program: Orca
programVersion: 5.0.2
elementType: O O O C C C C C C C C C C C C C C C C C C C C C C H H H H H H H H H H H H H H H H H H H H H H H H H H
charge: 0
multiplicity: 1
keywords: wb97x-d3
keywords: def2-TZVPP
keywords: def2/J RIJCOSX
keywords: DEFGRID2
keywords: scfconv7
keywords: smallprint printgap noloewdin
keywords: NOSOSCF
formula: C22H26O3
InChI: InChI=1/C22H26O3/c1-15(2)10-19-20(22(19,3)4)21(23)25-14-17-12-18(24-13-17)11-16-8-6-5-7-9-16/h5-10,12-13,19-20H,11,14H2,1-4H3
51 atoms
O  1.167255 -1.03864 0.118049
O  3.224616 -1.911699 0.092275
O  -2.92428 -1.990177 1.356026
C  3.709693 0.592165 -1.791371
C  4.330805 0.801542 -0.451844
C  2.881128 0.375267 -0.535274
C  3.320394 1.798365 -2.613147
C  4.158142 -0.581882 -2.626604
C  4.69456 2.155144 0.041116
C  2.48613 -0.976772 -0.083674
C  4.629472 2.560465 1.309757
C  5.04351 3.944629 1.707563
C  4.150005 1.687837 2.428914
C  0.638395 -2.28307 0.581763
C  -0.839525 -2.15865 0.614753
C  -1.728771 -2.062855 -0.501824
C  -1.632217 -2.106434 1.709442
C  -2.978282 -1.961734 0.008104
C  -4.312561 -1.789231 -0.621325
C  -4.901012 -0.420818 -0.367562
C  -6.048476 -0.263772 0.397568
C  -4.286818 0.710692 -0.895885
C  -6.578482 0.998507 0.629279
C  -4.812874 1.971197 -0.668692
C  -5.962466 2.118924 0.095934
H  4.996229 -0.000021 -0.139252
H  2.140162 1.142466 -0.341024
H  2.977775 2.629577 -1.996884
H  2.514963 1.545602 -3.304542
H  4.165707 2.152018 -3.207357
H  3.360612 -0.916449 -3.292977
H  4.472188 -1.431483 -2.025021
H  5.003738 -0.285877 -3.250501
H  5.070879 2.854038 -0.700754
H  4.218418 4.479058 2.185102
H  5.858395 3.917471 2.435081
H  5.375804 4.534524 0.854174
H  3.91081 0.67631 2.108325
H  4.908207 1.617569 3.212696
H  3.259029 2.112601 2.898645
H  1.033657 -2.513793 1.574524
H  0.949017 -3.091907 -0.083841
H  -1.4623 -2.0655 -1.546663
H  -1.417777 -2.144382 2.765428
H  -5.000814 -2.560437 -0.264373
H  -4.198344 -1.953439 -1.695154
H  -6.533411 -1.135889 0.819736
H  -3.381897 0.602614 -1.482555
H  -7.472996 1.104374 1.229099
H  -4.32434 2.841582 -1.087091
H  -6.373561 3.103735 0.274689
totalener: -1079.73209788 hartree
nucrepener: 2040.21001605 hartree
electener: -3119.94211392 hartree
oneelecener: -5518.56994037 hartree
twoeener: 2398.62782645 hartree
kineticenergy: 1074.90823627 hartree
xcener: -106.463812808023 hartree
chargesum: 0.0000000
charge: -0.249487 -0.388754 -0.248866 0.127018 -0.021975 -0.100130 -0.275382 -0.259589 -0.233303 0.323247 -0.006101 -0.211077 -0.225429 0.052321 -0.026098 -0.267445 -0.028339 0.211762 -0.131626 0.062712 -0.144921 -0.153742 -0.122715 -0.128172 -0.131867 0.105078 0.085758 0.085418 0.090480 0.090252 0.084495 0.101223 0.084543 0.092772 0.084198 0.086800 0.078356 0.081600 0.088937 0.087160 0.091305 0.102408 0.128262 0.136363 0.094402 0.110156 0.104589 0.112176 0.123153 0.123440 0.124633
qa: -0.2495 -0.3888 -0.2489 0.1270 -0.0220 -0.1001 -0.2754 -0.2596 -0.2333 0.3232 -0.0061 -0.2111 -0.2254 0.0523 -0.0261 -0.2674 -0.0283 0.2118 -0.1316 0.0627 -0.1449 -0.1537 -0.1227 -0.1282 -0.1319 0.1051 0.0858 0.0854 0.0905 0.0903 0.0845 0.1012 0.0845 0.0928 0.0842 0.0868 0.0784 0.0816 0.0889 0.0872 0.0913 0.1024 0.1283 0.1364 0.0944 0.1102 0.1046 0.1122 0.1232 0.1234 0.1246
va: 2.1227 2.1131 2.3128 3.7392 3.8204 3.8370 3.9117 3.8997 3.8988 4.2050 3.7360 3.9414 3.9423 3.8786 3.7273 4.0296 3.9826 3.6323 3.8874 3.6525 4.0020 3.9925 3.9612 3.9736 3.9606 1.0273 1.0313 1.0048 1.0063 1.0012 1.0017 1.0204 1.0025 1.0089 0.9990 0.9987 1.0097 1.0176 1.0019 1.0004 1.0037 0.9967 1.0174 1.0081 1.0124 1.0046 1.0119 1.0121 1.0008 1.0008 0.9999
dispcorr: -0.021800571 hartree
energy: -1079.753898446500
dipole: 22.64224 -23.09950 -0.45726 16.10021 -15.56708 0.53313 -3.88398 3.73789 -0.14609
magnitude: 0.71739 au
magnitude: 1.82347 debye
