program: Orca
programVersion: 5.0.2
elementType: O O O C C C C C C C C C C C C C C C C C C C C C C H H H H H H H H H H H H H H H H H H H H H H H H H H
charge: 0
multiplicity: 1
keywords: wb97x-d3
keywords: def2-TZVPP
keywords: def2/J RIJCOSX
keywords: DEFGRID2
keywords: scfconv7
keywords: smallprint printgap noloewdin
keywords: NOSOSCF
formula: C22H26O3
InChI: InChI=1/C22H26O3/c1-15(2)10-19-20(22(19,3)4)21(23)25-14-17-12-18(24-13-17)11-16-8-6-5-7-9-16/h5-10,12-13,19-20H,11,14H2,1-4H3
51 atoms
O  1.620123 -1.891441 -0.472624
O  0.667877 -0.641975 -2.066634
O  -2.210878 -2.666713 1.463249
C  1.820506 1.586598 -0.109885
C  2.507009 1.586736 -1.435203
C  2.375128 0.288506 -0.675342
C  2.548986 2.128143 1.096857
C  0.330038 1.818769 -0.05926
C  3.837288 2.217053 -1.636566
C  1.461249 -0.764372 -1.168018
C  4.756048 1.802089 -2.509516
C  6.062733 2.517716 -2.67048
C  4.565216 0.60882 -3.394684
C  0.703992 -2.962296 -0.727178
C  -0.611872 -2.722006 -0.075062
C  -1.730145 -1.990103 -0.58734
C  -0.975053 -3.105462 1.172074
C  -2.666034 -1.985728 0.389308
C  -3.986768 -1.316867 0.510886
C  -3.920661 -0.118804 1.429983
C  -3.217246 1.017287 1.04031
C  -4.521362 -0.136409 2.681146
C  -3.118176 2.112147 1.882196
C  -4.42355 0.958761 3.52915
C  -3.720999 2.085438 3.132928
H  1.832564 1.655914 -2.285531
H  3.263205 -0.080861 -0.174625
H  2.152959 1.684096 2.011485
H  2.421099 3.210112 1.173116
H  3.618931 1.922509 1.065644
H  -0.180748 1.456115 -0.948802
H  0.127697 2.888684 0.025459
H  -0.11584 1.327637 0.807892
H  4.053794 3.101755 -1.044501
H  6.903682 1.846564 -2.478172
H  6.186445 2.885318 -3.69216
H  6.151164 3.368381 -1.995787
H  5.334963 -0.143324 -3.202988
H  3.594132 0.134901 -3.268897
H  4.663828 0.890615 -4.446006
H  1.187594 -3.842938 -0.30592
H  0.58803 -3.119944 -1.80053
H  -1.805063 -1.520308 -1.553556
H  -0.470075 -3.67557 1.935562
H  -4.742821 -2.021679 0.866667
H  -4.29778 -1.006111 -0.488581
H  -2.733394 1.039793 0.070634
H  -5.068199 -1.015532 3.000285
H  -2.56738 2.987249 1.562102
H  -4.895639 0.928535 4.502451
H  -3.64306 2.93914 3.793154
totalener: -1079.73150558 hartree
nucrepener: 2143.57691331 hartree
electener: -3223.30841889 hartree
oneelecener: -5725.56728042 hartree
twoeener: 2502.25886153 hartree
kineticenergy: 1074.91895198 hartree
xcener: -106.468099368116 hartree
chargesum: 0.0000000
charge: -0.256067 -0.400188 -0.248555 0.158034 -0.026840 -0.111669 -0.282270 -0.295282 -0.235947 0.360409 -0.004938 -0.212119 -0.225744 0.043619 -0.056314 -0.284376 -0.031300 0.235117 -0.133911 0.083258 -0.187716 -0.146050 -0.127924 -0.121550 -0.133609 0.104687 0.082640 0.094616 0.089320 0.085278 0.093374 0.087206 0.104218 0.092863 0.084146 0.086634 0.078338 0.084891 0.081098 0.088523 0.099473 0.112447 0.146486 0.135003 0.094406 0.111428 0.125007 0.105130 0.127943 0.122685 0.124093
qa: -0.2561 -0.4002 -0.2486 0.1580 -0.0268 -0.1117 -0.2823 -0.2953 -0.2359 0.3604 -0.0049 -0.2121 -0.2257 0.0436 -0.0563 -0.2844 -0.0313 0.2351 -0.1339 0.0833 -0.1877 -0.1461 -0.1279 -0.1216 -0.1336 0.1047 0.0826 0.0946 0.0893 0.0853 0.0934 0.0872 0.1042 0.0929 0.0841 0.0866 0.0783 0.0849 0.0811 0.0885 0.0995 0.1124 0.1465 0.1350 0.0944 0.1114 0.1250 0.1051 0.1279 0.1227 0.1241
va: 2.1330 2.0979 2.3119 3.7591 3.8329 3.8302 3.9046 3.9037 3.8984 4.1934 3.7330 3.9418 3.9416 3.9054 3.6930 4.0010 3.9997 3.5914 3.8855 3.6294 3.9801 4.0053 3.9557 3.9595 3.9711 1.0262 1.0330 1.0064 1.0009 1.0046 1.0193 1.0027 0.9938 1.0089 0.9990 0.9985 1.0098 1.0006 1.0216 1.0018 0.9970 1.0051 1.0234 1.0070 1.0139 1.0060 1.0004 1.0119 0.9987 1.0005 0.9999
dispcorr: -0.025175038 hartree
energy: -1079.756680615119
dipole: 20.23833 -19.87817 0.36015 16.49068 -16.52825 -0.03758 -6.29474 6.63122 0.33648
magnitude: 0.49431 au
magnitude: 1.25643 debye
