program: Orca
programVersion: 5.0.2
elementType: O O O C C C C C C C C C C C C C C C C C C C C C C H H H H H H H H H H H H H H H H H H H H H H H H H H
charge: 0
multiplicity: 1
keywords: wb97x-d3
keywords: def2-TZVPP
keywords: def2/J RIJCOSX
keywords: DEFGRID2
keywords: scfconv7
keywords: smallprint printgap noloewdin
keywords: NOSOSCF
formula: C22H26O3
InChI: InChI=1/C22H26O3/c1-15(2)10-19-20(22(19,3)4)21(23)25-14-17-12-18(24-13-17)11-16-8-6-5-7-9-16/h5-10,12-13,19-20H,11,14H2,1-4H3
51 atoms
O  1.674097 -1.997734 -0.710866
O  2.462531 -1.278916 1.256136
O  -1.739636 -0.33419 1.54408
C  4.84438 -0.182273 -0.460591
C  3.844304 0.903952 -0.256506
C  3.385923 -0.442188 -0.787798
C  5.760497 -0.108613 -1.659307
C  5.494236 -0.817468 0.743808
C  3.787493 2.107327 -1.125296
C  2.493826 -1.26571 0.052683
C  2.671725 2.690962 -1.565706
C  2.7227 3.912378 -2.433001
C  1.294156 2.192519 -1.249285
C  0.595421 -2.658975 -0.045007
C  -0.461234 -1.686481 0.339043
C  -1.324017 -0.952278 -0.536499
C  -0.761339 -1.255125 1.585042
C  -2.076486 -0.148773 0.250484
C  -3.1611 0.825273 -0.039603
C  -4.497573 0.380311 0.502809
C  -5.311151 -0.467612 -0.240209
C  -4.922502 0.780869 1.76356
C  -6.528071 -0.901073 0.261857
C  -6.138855 0.347934 2.27059
C  -6.946212 -0.492851 1.520088
H  3.572359 1.068562 0.783735
H  3.153244 -0.474398 -1.845907
H  5.277272 0.339668 -2.527529
H  6.096043 -1.10687 -1.945154
H  6.648493 0.484564 -1.430768
H  4.842852 -0.838609 1.613371
H  6.393052 -0.257847 1.010578
H  5.798677 -1.843192 0.526789
H  4.741188 2.551714 -1.39703
H  3.744877 4.220329 -2.649772
H  2.215289 3.737625 -3.385293
H  2.211147 4.753404 -1.958573
H  0.787912 1.847325 -2.154753
H  1.282402 1.376093 -0.531394
H  0.679957 2.999198 -0.841852
H  0.952688 -3.212993 0.824585
H  0.221856 -3.378168 -0.773608
H  -1.372809 -1.019409 -1.611609
H  -0.354155 -1.495446 2.553216
H  -3.216926 0.949435 -1.122488
H  -2.902037 1.805924 0.370286
H  -4.987754 -0.794005 -1.221804
H  -4.295897 1.436697 2.355707
H  -7.152018 -1.557127 -0.33093
H  -6.456135 0.668987 3.254133
H  -7.896771 -0.828265 1.9133
totalener: -1079.73123938 hartree
nucrepener: 2103.74175794 hartree
electener: -3183.47299732 hartree
oneelecener: -5645.87671855 hartree
twoeener: 2462.40372123 hartree
kineticenergy: 1074.92503128 hartree
xcener: -106.468422314749 hartree
chargesum: -0.0000000
charge: -0.262783 -0.395041 -0.253461 0.137699 -0.024311 -0.109413 -0.271722 -0.260529 -0.242259 0.332931 0.000744 -0.213252 -0.219621 0.065125 -0.066317 -0.326313 0.016855 0.244586 -0.128528 0.100706 -0.169732 -0.156232 -0.122342 -0.124465 -0.132463 0.106222 0.085997 0.084277 0.091139 0.088946 0.101929 0.081386 0.083331 0.092916 0.078846 0.083909 0.086890 0.084965 0.085091 0.087404 0.106012 0.104250 0.120893 0.141874 0.099250 0.103503 0.104367 0.107243 0.122496 0.122984 0.124014
qa: -0.2628 -0.3950 -0.2535 0.1377 -0.0243 -0.1094 -0.2717 -0.2605 -0.2423 0.3329 0.0007 -0.2133 -0.2196 0.0651 -0.0663 -0.3263 0.0169 0.2446 -0.1285 0.1007 -0.1697 -0.1562 -0.1223 -0.1245 -0.1325 0.1062 0.0860 0.0843 0.0911 0.0889 0.1019 0.0814 0.0833 0.0929 0.0788 0.0839 0.0869 0.0850 0.0851 0.0874 0.1060 0.1042 0.1209 0.1419 0.0993 0.1035 0.1044 0.1072 0.1225 0.1230 0.1240
va: 2.1146 2.1007 2.3150 3.7206 3.8260 3.8259 3.9093 3.9007 3.8967 4.2062 3.7527 3.9409 3.9454 3.8902 3.6745 4.0286 3.9860 3.5920 3.8740 3.6055 4.0050 4.0139 3.9632 3.9584 3.9606 1.0259 1.0322 1.0050 1.0063 1.0019 1.0231 1.0018 1.0022 1.0099 1.0098 0.9986 0.9988 1.0013 1.0085 1.0025 1.0113 0.9903 1.0214 1.0117 1.0108 1.0066 1.0123 1.0149 1.0006 1.0006 1.0000
dispcorr: -0.024011444 hartree
energy: -1079.755250826933
dipole: 19.10025 -19.30364 -0.20339 11.61661 -11.43540 0.18122 -10.52740 9.77612 -0.75128
magnitude: 0.79914 au
magnitude: 2.03126 debye
