program: Orca
programVersion: 5.0.2
elementType: O O O C C C C C C C C C C C C C C C C C C C C C C H H H H H H H H H H H H H H H H H H H H H H H H H H
charge: 0
multiplicity: 1
keywords: wb97x-d3
keywords: def2-TZVPP
keywords: def2/J RIJCOSX
keywords: DEFGRID2
keywords: scfconv7
keywords: smallprint printgap noloewdin
keywords: NOSOSCF
formula: C22H26O3
InChI: InChI=1/C22H26O3/c1-15(2)10-19-20(22(19,3)4)21(23)25-14-17-12-18(24-13-17)11-16-8-6-5-7-9-16/h5-10,12-13,19-20H,11,14H2,1-4H3
51 atoms
O  1.720337 -1.766294 -0.130083
O  2.431168 -0.358064 1.457263
O  -1.910383 0.256327 1.404505
C  4.936455 -0.134501 -0.421444
C  4.046894 1.045765 -0.618084
C  3.458786 -0.348173 -0.702664
C  5.866082 -0.542067 -1.539808
C  5.508077 -0.401877 0.94958
C  4.123786 1.899195 -1.831853
C  2.509986 -0.795014 0.337469
C  3.084109 2.457558 -2.453809
C  3.273429 3.313672 -3.669428
C  1.663266 2.289207 -2.009394
C  0.686713 -2.233406 0.740616
C  -0.477693 -1.309236 0.764099
C  -1.498315 -1.171231 -0.230055
C  -0.786463 -0.407874 1.724861
C  -2.342003 -0.211307 0.214582
C  -3.607057 0.355794 -0.322115
C  -4.809391 -0.035508 0.503594
C  -5.233093 0.761534 1.560315
C  -5.493323 -1.217269 0.240782
C  -6.319879 0.388079 2.336862
C  -6.582022 -1.592729 1.012623
C  -6.998739 -0.789879 2.064288
H  3.787381 1.565892 0.301189
H  3.232134 -0.709029 -1.699417
H  6.805348 0.012255 -1.482579
H  5.436479 -0.365138 -2.525805
H  6.106165 -1.604142 -1.46847
H  6.457716 0.125614 1.05817
H  5.706642 -1.46631 1.089161
H  4.852456 -0.075188 1.752444
H  5.118921 2.097268 -2.220698
H  4.322573 3.404657 -3.948157
H  2.732533 2.902145 -4.525415
H  2.879844 4.320288 -3.508219
H  1.211463 3.262189 -1.800584
H  1.060352 1.832554 -2.79832
H  1.560298 1.67947 -1.114861
H  1.07584 -2.394809 1.746936
H  0.399512 -3.201716 0.33149
H  -1.589242 -1.724978 -1.150965
H  -0.299794 -0.132422 2.645799
H  -3.724604 0.002225 -1.347847
H  -3.53402 1.445842 -0.377207
H  -4.708342 1.683496 1.779275
H  -5.170474 -1.852128 -0.576169
H  -6.637661 1.019805 3.156006
H  -7.106487 -2.513285 0.791796
H  -7.848656 -1.080776 2.667399
totalener: -1079.73210035 hartree
nucrepener: 2073.31717118 hartree
electener: -3153.04927153 hartree
oneelecener: -5585.06170932 hartree
twoeener: 2432.01243778 hartree
kineticenergy: 1074.91760719 hartree
xcener: -106.466787817503 hartree
chargesum: -0.0000000
charge: -0.261920 -0.402100 -0.253150 0.125700 -0.021539 -0.109179 -0.273633 -0.259903 -0.237034 0.347175 -0.007591 -0.211514 -0.219023 0.058963 -0.073859 -0.290298 0.011463 0.226664 -0.139512 0.098252 -0.155206 -0.167498 -0.123786 -0.121254 -0.134823 0.105518 0.085199 0.089307 0.084825 0.091261 0.082515 0.084047 0.101857 0.092554 0.078550 0.083744 0.086381 0.089414 0.083529 0.085259 0.109093 0.103372 0.123191 0.146946 0.098289 0.105889 0.108440 0.104642 0.123630 0.123185 0.123968
qa: -0.2619 -0.4021 -0.2531 0.1257 -0.0215 -0.1092 -0.2736 -0.2599 -0.2370 0.3472 -0.0076 -0.2115 -0.2190 0.0590 -0.0739 -0.2903 0.0115 0.2267 -0.1395 0.0983 -0.1552 -0.1675 -0.1238 -0.1213 -0.1348 0.1055 0.0852 0.0893 0.0848 0.0913 0.0825 0.0840 0.1019 0.0926 0.0786 0.0837 0.0864 0.0894 0.0835 0.0853 0.1091 0.1034 0.1232 0.1469 0.0983 0.1059 0.1084 0.1046 0.1236 0.1232 0.1240
va: 2.1224 2.0949 2.3142 3.7323 3.8273 3.8240 3.9114 3.9004 3.8937 4.1949 3.7424 3.9410 3.9473 3.8808 3.6786 4.0489 3.9745 3.6175 3.8871 3.6013 4.0131 4.0048 3.9572 3.9617 3.9629 1.0266 1.0322 1.0015 1.0050 1.0062 1.0023 1.0020 1.0224 1.0096 1.0098 0.9992 0.9987 1.0016 1.0019 1.0133 1.0121 0.9920 1.0184 1.0122 1.0114 1.0063 1.0152 1.0119 1.0002 1.0003 1.0000
dispcorr: -0.022898964 hartree
energy: -1079.754999316898
dipole: 20.92015 -21.06392 -0.14376 8.11038 -8.28119 -0.17082 -13.39020 12.65829 -0.73191
magnitude: 0.76521 au
magnitude: 1.94500 debye
