program: Orca
programVersion: 5.0.2
elementType: O O O C C C C C C C C C C C C C C C C C C C C C C H H H H H H H H H H H H H H H H H H H H H H H H H H
charge: 0
multiplicity: 1
keywords: wb97x-d3
keywords: def2-TZVPP
keywords: def2/J RIJCOSX
keywords: DEFGRID2
keywords: scfconv7
keywords: smallprint printgap noloewdin
keywords: NOSOSCF
formula: C22H26O3
InChI: InChI=1/C22H26O3/c1-15(2)10-19-20(22(19,3)4)21(23)25-14-17-12-18(24-13-17)11-16-8-6-5-7-9-16/h5-10,12-13,19-20H,11,14H2,1-4H3
51 atoms
O  1.925997 -2.269145 -0.841648
O  2.07603 -1.736207 1.326212
O  -2.361194 -2.089644 -0.86722
C  3.860944 0.642018 0.335196
C  2.439558 1.080689 0.437169
C  2.780764 -0.175622 -0.345322
C  4.776867 1.387603 -0.607052
C  4.565236 0.127405 1.566211
C  1.91431 2.282303 -0.258338
C  2.25411 -1.455327 0.168049
C  0.78004 2.333327 -0.959799
C  0.330638 3.605848 -1.611466
C  -0.121235 1.152713 -1.173746
C  1.051089 -3.361356 -0.539973
C  -0.341683 -2.862314 -0.367975
C  -0.959994 -2.361957 0.822687
C  -1.248362 -2.664188 -1.354199
C  -2.179626 -1.903554 0.458195
C  -3.257044 -1.199987 1.203182
C  -3.288898 0.276969 0.885427
C  -4.062494 0.763509 -0.162183
C  -2.508451 1.169414 1.612411
C  -4.063222 2.115872 -0.472119
C  -2.507733 2.521742 1.307891
C  -3.287227 2.999336 0.264025
H  1.980232 0.868715 1.400453
H  2.744193 -0.08232 -1.424394
H  5.2258 2.248406 -0.107187
H  4.253303 1.754544 -1.489809
H  5.589547 0.742037 -0.944505
H  5.37246 -0.555656 1.294555
H  3.898373 -0.397204 2.24517
H  5.011001 0.962878 2.109777
H  2.499553 3.192446 -0.153599
H  1.034711 4.422544 -1.453482
H  0.204951 3.472648 -2.689356
H  -0.643002 3.913543 -1.221937
H  0.042158 0.712939 -2.161972
H  0.016612 0.365457 -0.435762
H  -1.168892 1.454743 -1.133881
H  1.394036 -3.90662 0.33994
H  1.124744 -4.024176 -1.401234
H  -0.531599 -2.338096 1.810693
H  -1.233982 -2.876776 -2.411282
H  -3.080056 -1.347627 2.269591
H  -4.227785 -1.6524 0.982807
H  -4.671112 0.079374 -0.741226
H  -1.889552 0.802421 2.422819
H  -4.673097 2.480059 -1.288647
H  -1.894683 3.202579 1.883758
H  -3.292548 4.055506 0.027898
totalener: -1079.73025007 hartree
nucrepener: 2246.15669030 hartree
electener: -3325.88694038 hartree
oneelecener: -5930.83303055 hartree
twoeener: 2604.94609018 hartree
kineticenergy: 1074.91066261 hartree
xcener: -106.468502842770 hartree
chargesum: 0.0000000
charge: -0.262586 -0.402314 -0.249224 0.146240 -0.012956 -0.107843 -0.268829 -0.261067 -0.262528 0.334282 0.017391 -0.210288 -0.198987 0.056123 -0.075242 -0.242367 -0.031422 0.206824 -0.128810 0.095003 -0.155086 -0.178936 -0.097038 -0.098321 -0.187599 0.097917 0.083428 0.087339 0.085128 0.091178 0.082334 0.100838 0.080914 0.091919 0.077784 0.088152 0.081299 0.103165 0.052191 0.082464 0.111729 0.100686 0.140720 0.133583 0.101724 0.106666 0.108525 0.108692 0.124076 0.124030 0.129096
qa: -0.2626 -0.4023 -0.2492 0.1462 -0.0130 -0.1078 -0.2688 -0.2611 -0.2625 0.3343 0.0174 -0.2103 -0.1990 0.0561 -0.0752 -0.2424 -0.0314 0.2068 -0.1288 0.0950 -0.1551 -0.1789 -0.0970 -0.0983 -0.1876 0.0979 0.0834 0.0873 0.0851 0.0912 0.0823 0.1008 0.0809 0.0919 0.0778 0.0882 0.0813 0.1032 0.0522 0.0825 0.1117 0.1007 0.1407 0.1336 0.1017 0.1067 0.1085 0.1087 0.1241 0.1240 0.1291
va: 2.1152 2.0891 2.2978 3.7156 3.8127 3.8490 3.9057 3.8971 3.8828 4.2016 3.7356 3.9377 3.9353 3.8948 3.7147 3.9838 3.9686 3.6102 3.8733 3.5818 4.0101 3.9613 3.9138 3.8768 3.9325 1.0297 1.0320 1.0024 1.0056 1.0062 1.0027 1.0233 1.0018 1.0110 1.0104 0.9992 1.0011 1.0065 1.0164 1.0039 1.0082 0.9959 1.0249 1.0069 1.0124 1.0091 1.0161 1.0124 1.0004 1.0016 1.0005
dispcorr: -0.029384527 hartree
energy: -1079.759634600068
dipole: 12.11733 -12.40251 -0.28518 16.52348 -16.30517 0.21832 -2.57662 2.08281 -0.49381
magnitude: 0.61061 au
magnitude: 1.55204 debye
