program: Orca
programVersion: 5.0.2
elementType: O O O C C C C C C C C C C C C C C C C C C C C C C H H H H H H H H H H H H H H H H H H H H H H H H H H
charge: 0
multiplicity: 1
keywords: wb97x-d3
keywords: def2-TZVPP
keywords: def2/J RIJCOSX
keywords: DEFGRID2
keywords: scfconv7
keywords: smallprint printgap noloewdin
keywords: NOSOSCF
formula: C22H26O3
InChI: InChI=1/C22H26O3/c1-15(2)10-19-20(22(19,3)4)21(23)25-14-17-12-18(24-13-17)11-16-8-6-5-7-9-16/h5-10,12-13,19-20H,11,14H2,1-4H3
51 atoms
O  1.551769 -1.808787 -0.993214
O  2.34963 -2.071628 1.081006
O  -1.909458 -2.736516 1.440252
C  1.661347 1.191183 -0.018235
C  2.526148 0.877234 -1.207305
C  2.632516 0.023959 0.025326
C  2.018344 2.379012 0.840507
C  0.173325 0.950647 -0.108788
C  3.675584 1.730639 -1.60425
C  2.175282 -1.382403 0.110904
C  3.592191 2.799884 -2.39642
C  4.808238 3.586299 -2.781376
C  2.298812 3.293671 -2.969347
C  0.872155 -3.065667 -0.907136
C  -0.419634 -2.896574 -0.192132
C  -1.618308 -2.309402 -0.707554
C  -0.664207 -3.1287 1.118239
C  -2.484073 -2.228407 0.328764
C  -3.821856 -1.596453 0.480662
C  -3.696996 -0.201933 1.05037
C  -3.471537 -0.007088 2.409542
C  -3.745698 0.907989 0.21557
C  -3.295101 1.269678 2.920409
C  -3.572456 2.187098 0.723789
C  -3.342834 2.37125 2.078688
H  1.995121 0.415057 -2.033921
H  3.497316 0.19411 0.658671
H  1.60747 2.26283 1.844668
H  1.603807 3.295289 0.414532
H  3.094622 2.5210 0.930491
H  -0.08964 0.160866 -0.80803
H  -0.330598 1.861789 -0.437453
H  -0.248991 0.683311 0.861765
H  4.654382 1.440806 -1.232141
H  4.941192 3.600456 -3.865879
H  4.719866 4.628522 -2.46519
H  5.716285 3.177885 -2.340034
H  2.148165 4.349398 -2.731102
H  2.303055 3.220657 -4.060019
H  1.435673 2.743009 -2.60037
H  1.501897 -3.814262 -0.424937
H  0.713899 -3.369378 -1.941603
H  -1.797177 -1.970654 -1.715845
H  -0.057822 -3.537232 1.909357
H  -4.46211 -2.213165 1.117022
H  -4.299825 -1.557415 -0.49942
H  -3.427079 -0.860621 3.07456
H  -3.918523 0.77147 -0.845726
H  -3.118805 1.404617 3.979818
H  -3.616414 3.04011 0.05947
H  -3.204877 3.367335 2.478158
totalener: -1079.72819103 hartree
nucrepener: 2184.02799409 hartree
electener: -3263.75618512 hartree
oneelecener: -5806.39137062 hartree
twoeener: 2542.63518550 hartree
kineticenergy: 1074.92045535 hartree
xcener: -106.467766400177 hartree
chargesum: 0.0000000
charge: -0.263991 -0.372939 -0.255571 0.139056 0.008470 -0.107844 -0.250526 -0.305122 -0.215499 0.340804 -0.022307 -0.212590 -0.238364 0.038295 -0.040080 -0.358244 0.006354 0.266326 -0.124283 0.085554 -0.160487 -0.163967 -0.123855 -0.137180 -0.124990 0.100163 0.080587 0.098033 0.082603 0.081101 0.085569 0.081790 0.104848 0.089662 0.085080 0.084223 0.078998 0.084821 0.095760 0.079567 0.112586 0.100263 0.128483 0.149622 0.109783 0.091746 0.113627 0.100122 0.124843 0.123911 0.125187
qa: -0.2640 -0.3729 -0.2556 0.1391 0.0085 -0.1078 -0.2505 -0.3051 -0.2155 0.3408 -0.0223 -0.2126 -0.2384 0.0383 -0.0401 -0.3582 0.0064 0.2663 -0.1243 0.0856 -0.1605 -0.1640 -0.1239 -0.1372 -0.1250 0.1002 0.0806 0.0980 0.0826 0.0811 0.0856 0.0818 0.1048 0.0897 0.0851 0.0842 0.0790 0.0848 0.0958 0.0796 0.1126 0.1003 0.1285 0.1496 0.1098 0.0917 0.1136 0.1001 0.1248 0.1239 0.1252
va: 2.1045 2.1277 2.3066 3.7026 3.7701 3.8837 3.9038 3.9055 3.8613 4.2806 3.7355 3.9407 3.9401 3.9002 3.6654 4.0128 3.9868 3.5576 3.8760 3.6229 3.9990 3.9631 3.9614 3.9423 3.9470 1.0225 1.0322 1.0049 1.0027 1.0079 1.0131 1.0051 0.9999 1.0144 0.9976 0.9988 1.0109 1.0006 1.0012 1.0105 1.0100 0.9943 1.0169 1.0124 1.0099 1.0150 1.0196 1.0134 1.0003 1.0006 0.9994
dispcorr: -0.027041000 hartree
energy: -1079.755232033383
dipole: 10.76776 -11.30889 -0.54113 24.03127 -23.37345 0.65781 -10.46760 9.71063 -0.75697
magnitude: 1.13954 au
magnitude: 2.89647 debye
