program: Orca
programVersion: 5.0.2
elementType: O O O C C C C C C C C C C C C C C C C C C C C C C H H H H H H H H H H H H H H H H H H H H H H H H H H
charge: 0
multiplicity: 1
keywords: wb97x-d3
keywords: def2-TZVPP
keywords: def2/J RIJCOSX
keywords: DEFGRID2
keywords: scfconv7
keywords: smallprint printgap noloewdin
keywords: NOSOSCF
formula: C22H26O3
InChI: InChI=1/C22H26O3/c1-15(2)10-19-20(22(19,3)4)21(23)25-14-17-12-18(24-13-17)11-16-8-6-5-7-9-16/h5-10,12-13,19-20H,11,14H2,1-4H3
51 atoms
O  1.560878 -1.581293 0.707018
O  1.565375 -1.198984 -1.495981
O  -2.613377 -2.104121 -0.603514
C  2.210427 1.726082 -0.571533
C  3.452682 1.046472 -1.063718
C  2.595091 0.368135 -0.01343
C  2.321594 2.888867 0.385462
C  1.04861 1.868821 -1.524864
C  4.810113 1.509623 -0.723559
C  1.859046 -0.861964 -0.377273
C  5.853772 1.605847 -1.551144
C  7.181096 2.102834 -1.059719
C  5.83165 1.248822 -3.006686
C  0.811227 -2.782247 0.497454
C  -0.642964 -2.516222 0.324966
C  -1.63302 -2.403013 1.352306
C  -1.307051 -2.318263 -0.838283
C  -2.80952 -2.154909 0.731729
C  -4.190046 -1.919839 1.233431
C  -4.592156 -0.463203 1.222226
C  -4.672354 0.254723 2.409313
C  -4.882198 0.188575 0.027156
C  -5.03767 1.593147 2.408726
C  -5.245008 1.526074 0.022544
C  -5.325368 2.233336 1.213833
H  3.341742 0.603821 -2.047076
H  2.969516 0.381697 1.004297
H  1.38593 3.017064 0.932286
H  2.518697 3.814022 -0.159043
H  3.114452 2.766056 1.122184
H  0.101455 1.907192 -0.983428
H  0.989081 1.057071 -2.244762
H  1.149457 2.802742 -2.080933
H  4.970382 1.799262 0.310891
H  7.490651 2.998576 -1.604566
H  7.163175 2.347379 0.001833
H  7.964295 1.356948 -1.218655
H  4.866282 0.894056 -3.358867
H  6.106947 2.112659 -3.616857
H  6.568336 0.470869 -3.222203
H  0.984636 -3.375497 1.394505
H  1.211326 -3.334114 -0.35407
H  -1.4803 -2.496325 2.415784
H  -0.98241 -2.298272 -1.865147
H  -4.247066 -2.306592 2.252069
H  -4.901002 -2.505405 0.643064
H  -4.449249 -0.238085 3.34836
H  -4.82408 -0.353343 -0.908664
H  -5.099052 2.134149 3.344009
H  -5.468932 2.017856 -0.915138
H  -5.612081 3.276648 1.210049
totalener: -1079.73321078 hartree
nucrepener: 2068.98758526 hartree
electener: -3148.72079603 hartree
oneelecener: -5576.42227751 hartree
twoeener: 2427.70148148 hartree
kineticenergy: 1074.90547670 hartree
xcener: -106.466040616868 hartree
chargesum: -0.0000000
charge: -0.263654 -0.409783 -0.258710 0.085574 0.040364 -0.091396 -0.250314 -0.257543 -0.182225 0.366572 -0.053335 -0.203355 -0.236993 0.062404 -0.082557 -0.272133 0.007139 0.229828 -0.131132 0.084390 -0.161813 -0.168894 -0.116527 -0.121096 -0.137877 0.087525 0.070492 0.092864 0.091510 0.070210 0.089027 0.096843 0.084244 0.070368 0.083403 0.075871 0.083752 0.084445 0.084282 0.085579 0.099217 0.113866 0.124755 0.149721 0.086731 0.110281 0.102553 0.114187 0.122699 0.124258 0.124381
qa: -0.2637 -0.4098 -0.2587 0.0856 0.0404 -0.0914 -0.2503 -0.2575 -0.1822 0.3666 -0.0533 -0.2034 -0.2370 0.0624 -0.0826 -0.2721 0.0071 0.2298 -0.1311 0.0844 -0.1618 -0.1689 -0.1165 -0.1211 -0.1379 0.0875 0.0705 0.0929 0.0915 0.0702 0.0890 0.0968 0.0842 0.0704 0.0834 0.0759 0.0838 0.0844 0.0843 0.0856 0.0992 0.1139 0.1248 0.1497 0.0867 0.1103 0.1026 0.1142 0.1227 0.1243 0.1244
va: 2.1383 2.0903 2.3091 3.7428 3.7849 3.8816 3.9154 3.9130 3.9037 4.2140 3.8299 3.9340 3.9445 3.8701 3.6910 4.0508 3.9674 3.6262 3.8798 3.6488 3.9986 4.0107 3.9580 3.9545 3.9668 1.0355 1.0370 1.0041 1.0039 1.0110 1.0028 1.0230 1.0009 1.0218 0.9980 1.0124 0.9982 1.0162 0.9991 0.9989 0.9953 1.0092 1.0165 1.0147 1.0139 1.0044 1.0117 1.0218 1.0007 1.0004 1.0000
dispcorr: -0.021851892 hartree
energy: -1079.755062669508
dipole: 23.81863 -23.71282 0.10581 17.77104 -17.56273 0.20831 -5.07675 5.63181 0.55506
magnitude: 0.60223 au
magnitude: 1.53076 debye
