program: Gaussian 09
title: 000071684
version: EM64L-G09RevD.01
frameworkgroup: C1[X(C19H24N2O4)]
method: RPBEPBE
basis: SDD
operation: Freq
keyword: #p
keyword: freq=noraman
keyword: PBEPBE/SDD
title: #p freq=noraman PBEPBE/SDD
converged: YES YES NO NO
title: Mulliken charges:
elementType: O O O O N N C C C C C C C C C C C C C C C C C C C H H H H H H H H H H H H H H H H H H H H H H H H
charge: -0.474738 -0.298136 -0.414589 -0.408306 -0.093368 -0.151673 -0.352677 -0.367749 -0.439327 -0.480690 -0.386815 -0.185758 0.339536 0.447181 0.206851 -0.344380 -0.556139 -0.421874 -0.337577 -0.264567 -0.268011 0.199014 -0.333389 0.143115 -0.537278 0.207733 0.193457 0.204528 0.220928 0.268399 0.208043 0.227253 0.229861 0.178016 0.235656 0.205874 0.230297 0.340928 0.262945 0.286198 0.234809 0.221017 0.223774 0.215237 0.226442 0.240935 0.217949 0.350157 0.350907
chargesum: 0.00000
title: Mulliken charges with hydrogens summed into heavy atoms:
elementType: O O O O N N C C C C C C C C C C C C C C C C C C C
charge: -0.133810 -0.298136 -0.064432 -0.057399 -0.093368 -0.151673 0.048513 0.057707 0.037116 -0.023576 0.026856 0.020115 0.339536 0.447181 0.206851 -0.114083 -0.293195 -0.135676 -0.102768 -0.043550 -0.044237 0.199014 -0.118152 0.143115 0.148048
polarizability: 3.34736937e+02 1.26277755e+01 2.01774369e+02 5.20068037e+00 -6.31457436e+00 1.89280820e+02
1716.lowfreq: -4.6669 0.0004 0.0006 0.0008 2.6506 8.4473 12.2187 13.2196 22.9420
frequency: 12.1165 13.0777 22.7322 39.7784 50.6885 80.4295 95.5974 97.5317 124.7638 143.1691 164.2163 186.6494 192.2484 211.5911 241.7666 259.2994 276.0459 278.5040 291.2998 296.9511 305.3758 328.2993 333.5034 336.2536 355.8722 361.0179 380.3569 402.0825 425.6136 438.3981 445.9290 466.9494 471.4607 480.5887 506.9765 537.5394 554.4148 558.6072 577.2646 583.9403 609.0601 633.0083 685.6193 706.7148 722.3534 723.3043 738.7747 750.7805 765.0156 772.9846 803.6396 825.5058 837.4521 872.9979 896.6585 898.9734 911.6904 917.2165 938.4160 952.2742 971.5974 983.9095 1002.0052 1005.6005 1022.9559 1046.9950 1055.7631 1056.9104 1067.1590 1092.7920 1110.5056 1110.9782 1126.3470 1133.6112 1139.3951 1144.0226 1153.1009 1155.5572 1168.7725 1175.7450 1193.4191 1197.0289 1200.8264 1229.5483 1237.6221 1246.4628 1274.5491 1281.1358 1282.7620 1290.6519 1294.7294 1317.9945 1326.9732 1339.8708 1350.9563 1357.7994 1369.3902 1379.5937 1384.8658 1391.0077 1405.7114 1418.2000 1430.1240 1442.6826 1449.7421 1460.1516 1461.9436 1466.8084 1469.3860 1474.0313 1476.0061 1505.1088 1518.0917 1579.4072 1603.8580 1607.1325 1633.0379 2829.5794 2855.5014 2870.0852 2934.7934 2958.2237 2975.4358 2982.9729 3022.6277 3029.3946 3046.0657 3049.3615 3078.7013 3105.0447 3110.6904 3119.1983 3120.0091 3129.3476 3144.9528 3157.0954 3170.5588 3188.9621 3566.8963 3572.9372 3576.2957
redmass: 5.3356 4.9098 5.0645 5.9812 4.0021 3.6569 5.1220 3.5154 3.9961 4.6091 4.6831 3.7063 3.3791 3.7895 1.5542 1.2472 3.3469 2.6302 4.2649 2.4272 3.7982 2.3686 1.4518 1.4677 1.9822 2.7207 2.7544 3.4731 4.1291 3.6185 3.0318 2.7304 3.4428 3.0461 4.7787 4.0650 5.7922 4.4777 4.7878 5.1913 2.4374 3.2414 4.2982 4.3057 3.6315 3.6917 1.2462 5.3512 4.1725 4.2628 1.4217 1.4804 1.6011 1.4141 3.6185 1.4131 2.5491 2.9326 1.3361 1.2943 2.2598 8.3690 2.7996 4.4296 2.5770 2.1454 2.4539 2.0906 2.4204 2.5804 1.7296 1.5438 2.4115 2.2508 1.5950 1.4109 1.4500 1.2066 1.9648 1.1716 1.2082 1.4578 1.4795 1.6082 1.5352 1.9840 1.5615 1.4292 1.7918 1.3879 1.4981 1.3651 1.2989 1.2363 1.3826 1.3051 1.6739 4.5499 1.9042 1.7574 4.7983 3.4468 1.5278 1.5679 1.1165 1.0841 1.0843 1.0512 1.1190 1.1355 1.0779 2.7917 3.2575 6.5432 6.5816 6.6140 6.4132 1.0709 1.0703 1.0690 1.0824 1.0327 1.0677 1.0692 1.0886 1.0913 1.1037 1.0888 1.0952 1.0914 1.0903 1.0968 1.0971 1.0847 1.0888 1.0930 1.0998 1.0932 1.0659 1.0657 1.0661
irintensity: 0.1679 0.0306 0.5268 0.4259 0.6597 2.4825 0.3439 4.9828 4.0115 1.4636 2.4314 4.8861 2.1024 2.0704 2.0900 101.8652 23.5324 7.9769 14.9443 6.3054 0.8809 31.3940 14.5532 80.5723 128.2027 36.1429 3.3119 10.7976 8.3285 3.5149 3.4277 6.0318 5.7951 2.4753 0.6059 1.6982 6.1291 5.1883 8.9927 12.0792 3.8230 18.0657 5.9712 16.8106 4.4964 8.8501 102.0152 28.4544 9.8264 3.2646 42.2315 0.3218 0.0570 30.6605 23.4764 5.3902 6.8326 10.1899 1.1134 0.0173 11.7588 59.1184 71.0559 104.3077 24.8212 19.6356 7.7621 10.9410 78.8631 5.0186 33.3233 27.4453 22.9364 62.9853 253.0647 213.3477 2.8806 14.1831 33.6428 2.5005 11.3680 65.1022 77.4630 80.1471 33.9336 29.4344 17.3225 14.7145 33.8640 3.1996 16.1230 7.5981 6.1487 9.8870 1.8458 38.5904 17.8817 26.6504 56.0786 5.5509 0.3226 29.4408 11.4554 37.4073 3.2799 4.9057 9.7902 13.6243 16.7662 11.2315 40.6487 200.7314 111.3013 8.9023 111.3057 22.1856 10.4353 83.7478 58.8973 130.9475 49.9308 79.2280 46.8703 70.1377 58.9939 54.5426 45.6390 28.0489 24.5385 7.7106 27.4814 16.4435 11.2468 4.0629 14.7967 37.8423 15.3493 1.7198 5.9416 27.7708 32.6880
temp: 298.150 k
press: 1.00000 atm
elementType: 8 8 8 8 7 7 6 6 6 6 6 6 6 6 6 6 6 6 6 6 6 6 6 6 6 1 1 1 1 1 1 1 1 1 1 1 1 1 1 1 1 1 1 1 1 1 1 1 1
symmnumber: 1
zpe: 1050072.4 jmol-1
zpe.correction: 0.399951 hartree
zpe.thermalcorrener: 0.423973 hartree
zpe.thermalcorrenthalpy: 0.424917 hartree
zpe.thermalcorrgfe: 0.344151 hartree
zpe.sumelectzpe: -1146.878616 hartree
zpe.sumelectthermal: -1146.854595 hartree
zpe.sumelectthermalent: -1146.853651 hartree
zpe.sumelectthermalfe: -1146.934417 hartree
dipole: 3.6919 2.2947 1.3209
dipole: 4.5432
quadrupole: -141.0620 -153.4542 -139.9278
quadrupole: -10.3616 12.3308 -3.1310
quadrupole: 3.7527 -8.6396 4.8869 -10.3616 12.3308 -3.1310
hfenergy: -1147.2785678 hartree
pointgroup: C01 [X(C19H24N2O4)]
dipole: 1.3673927 0.5242558 1.0248361 debye
polarizability: 330.3088191|0.9477596|203.722445|28.8166161|-0.2599144|191.7608619 unknown
InChI: InChI=1S/C19H24N2O4/c1-25-19-5-3-2-4-15(19)21-10-8-20(9-11-21)13-18(24)14-6-7-16(22)17(23)12-14/h2-7,12,18,22-24H,8-11,13H2,1H3
charge 0 multiplicity 1
49 atoms
O  -3.196088 2.783616 1.630538
O  3.902867 -1.768586 1.613589
O  -4.05921 -2.190491 -1.92517
O  -6.526612 -1.098655 -2.224742
N  -0.397604 0.808423 0.042061
N  2.121313 -0.635685 -0.225417
C  0.45913 0.523717 1.224612
C  0.420264 0.940248 -1.193557
C  1.297272 -0.755923 1.000494
C  1.269407 -0.338465 -1.392254
C  -1.308603 1.955722 0.258174
C  -2.590758 1.568515 1.058704
C  3.469707 -0.205514 -0.18511
C  -3.65443 0.892384 0.199701
C  4.412195 -0.778648 0.742599
C  3.985258 0.747911 -1.110171
C  -3.354941 -0.330814 -0.453836
C  -4.938554 1.457571 0.040417
C  5.766847 -0.384264 0.740821
C  5.347761 1.119626 -1.127692
C  6.244725 0.563839 -0.194995
C  -4.314657 -0.979331 -1.258074
C  -5.902486 0.808264 -0.764596
C  -5.606927 -0.40743 -1.417815
C  4.853499 -2.45991 2.485091
H  -0.186148 0.381956 2.11199
H  1.147709 1.381174 1.439366
H  1.092144 1.833799 -1.147996
H  -0.26296 1.070247 -2.053492
H  1.94437 -0.955765 1.865026
H  0.607269 -1.614896 0.878503
H  0.571513 -1.190655 -1.520931
H  1.881457 -0.266992 -2.306092
H  -0.78695 2.78502 0.805233
H  -1.621007 2.359543 -0.721302
H  -2.295202 0.881036 1.882395
H  3.304191 1.22312 -1.822616
H  -2.52029 3.243996 2.188775
H  -2.346788 -0.753706 -0.346033
H  -5.173232 2.395078 0.548118
H  6.467089 -0.830051 1.45376
H  5.695503 1.855941 -1.860516
H  7.300654 0.852921 -0.18886
H  -6.900385 1.252034 -0.882934
H  5.643533 -2.964582 1.895883
H  4.254809 -3.210381 3.022818
H  5.320191 -1.765725 3.211394
H  -3.139004 -2.494319 -1.723203
H  -7.385641 -0.607612 -2.251058
