program: Orca
programVersion: 5.0.2
elementType: O O O C C C C C C C C C C C C C C C C C C C C C C H H H H H H H H H H H H H H H H H H H H H H H H H H
charge: 0
multiplicity: 1
keywords: wb97x-d3
keywords: def2-TZVPP
keywords: def2/J RIJCOSX
keywords: DEFGRID2
keywords: scfconv7
keywords: smallprint printgap noloewdin
keywords: NOSOSCF
formula: C22H26O3
InChI: InChI=1/C22H26O3/c1-15(2)10-19-20(22(19,3)4)21(23)25-14-17-12-18(24-13-17)11-16-8-6-5-7-9-16/h5-10,12-13,19-20H,11,14H2,1-4H3
51 atoms
O  1.104035 0.031151 0.914821
O  1.953476 -1.422944 -0.555932
O  -2.380693 -1.961521 -0.893201
C  2.960647 1.206407 -1.950717
C  4.075351 0.538169 -1.204082
C  2.765917 0.825231 -0.495488
C  3.040656 2.686841 -2.241107
C  2.268226 0.434854 -3.047999
C  5.304434 1.238585 -0.788965
C  1.918771 -0.315206 -0.081966
C  6.555756 0.781719 -0.883058
C  7.713173 1.609153 -0.407132
C  6.941861 -0.551055 -1.450069
C  0.262032 -0.994335 1.452691
C  -0.971669 -1.220934 0.649647
C  -2.275322 -0.690701 0.911085
C  -1.107372 -1.98487 -0.461129
C  -3.090264 -1.176735 -0.054128
C  -4.542054 -1.008509 -0.341624
C  -5.257422 -0.354446 0.808691
C  -5.607898 -1.10049 1.930179
C  -5.554975 1.002306 0.78997
C  -6.246182 -0.505022 3.005865
C  -6.193657 1.603643 1.865798
C  -6.540822 0.851138 2.976618
H  4.195623 -0.509565 -1.455015
H  2.760421 1.659007 0.198079
H  3.470577 3.261282 -1.421741
H  2.045393 3.090142 -2.434749
H  3.652682 2.868861 -3.126205
H  2.280047 -0.639374 -2.883176
H  2.763356 0.632425 -4.000525
H  1.226811 0.747328 -3.147008
H  5.168632 2.224964 -0.355054
H  8.422868 1.79576 -1.217243
H  7.396445 2.573565 -0.011991
H  8.269115 1.091571 0.378909
H  7.482332 -1.143408 -0.707942
H  6.098515 -1.144585 -1.793806
H  7.620057 -0.423803 -2.297338
H  -0.00294 -0.637702 2.447153
H  0.82917 -1.919125 1.567163
H  -2.564981 -0.041869 1.721924
H  -0.407024 -2.572991 -1.029849
H  -4.987048 -1.986212 -0.550465
H  -4.678651 -0.416139 -1.25214
H  -5.374834 -2.158297 1.960122
H  -5.285672 1.596445 -0.075163
H  -6.515864 -1.100316 3.868434
H  -6.421297 2.661072 1.833799
H  -7.041259 1.317046 3.815223
totalener: -1079.73365575 hartree
nucrepener: 2029.99823890 hartree
electener: -3109.73189465 hartree
oneelecener: -5498.32433614 hartree
twoeener: 2388.59244149 hartree
kineticenergy: 1074.90214694 hartree
xcener: -106.466643378803 hartree
chargesum: -0.0000000
charge: -0.261981 -0.414411 -0.254249 0.086280 0.042344 -0.091047 -0.248409 -0.258282 -0.185781 0.363069 -0.052757 -0.203052 -0.237207 0.064651 -0.085862 -0.243285 -0.000734 0.159089 -0.056456 0.013760 -0.162130 -0.143588 -0.118655 -0.124698 -0.128328 0.087917 0.071024 0.070575 0.091680 0.092077 0.096867 0.084759 0.086961 0.070912 0.082819 0.075666 0.084511 0.085744 0.084442 0.084951 0.098098 0.115436 0.138459 0.153920 0.100238 0.087532 0.113104 0.108861 0.125532 0.124627 0.125008
qa: -0.2620 -0.4144 -0.2542 0.0863 0.0423 -0.0910 -0.2484 -0.2583 -0.1858 0.3631 -0.0528 -0.2031 -0.2372 0.0647 -0.0859 -0.2433 -0.0007 0.1591 -0.0565 0.0138 -0.1621 -0.1436 -0.1187 -0.1247 -0.1283 0.0879 0.0710 0.0706 0.0917 0.0921 0.0969 0.0848 0.0870 0.0709 0.0828 0.0757 0.0845 0.0857 0.0844 0.0850 0.0981 0.1154 0.1385 0.1539 0.1002 0.0875 0.1131 0.1089 0.1255 0.1246 0.1250
va: 2.1409 2.0838 2.3088 3.7402 3.7793 3.8840 3.9163 3.9158 3.9030 4.2117 3.8296 3.9346 3.9454 3.8583 3.6934 4.0202 3.9673 3.7067 3.8512 3.6780 3.9846 3.9716 3.9520 3.9616 3.9539 1.0358 1.0374 1.0111 1.0040 1.0037 1.0220 1.0012 1.0024 1.0217 0.9983 1.0124 0.9981 0.9990 1.0159 0.9991 0.9974 1.0072 1.0076 1.0159 1.0073 1.0066 1.0099 1.0115 1.0000 1.0005 0.9999
dispcorr: -0.021755240 hartree
energy: -1079.755410988086
dipole: 28.64373 -28.68772 -0.04399 10.69899 -10.13391 0.56508 -8.87002 9.12442 0.25440
magnitude: 0.62126 au
magnitude: 1.57913 debye
