program: Orca
programVersion: 5.0.2
elementType: O O O C C C C C C C C C C C C C C C C C C C C C C H H H H H H H H H H H H H H H H H H H H H H H H H H
charge: 0
multiplicity: 1
keywords: wb97x-d3
keywords: def2-TZVPP
keywords: def2/J RIJCOSX
keywords: DEFGRID2
keywords: scfconv7
keywords: smallprint printgap noloewdin
keywords: NOSOSCF
formula: C22H26O3
InChI: InChI=1/C22H26O3/c1-15(2)10-19-20(22(19,3)4)21(23)25-14-17-12-18(24-13-17)11-16-8-6-5-7-9-16/h5-10,12-13,19-20H,11,14H2,1-4H3
51 atoms
O  0.995874 -0.662279 -1.637935
O  1.270333 1.528325 -1.275168
O  -2.33232 0.576956 0.979682
C  3.743881 0.47183 0.367137
C  4.183104 1.074606 -0.924243
C  3.095991 0.022204 -0.933424
C  4.634294 -0.555123 1.026346
C  2.982984 1.32272 1.353841
C  5.521636 0.787256 -1.501723
C  1.713169 0.407841 -1.285091
C  5.789398 0.600503 -2.794612
C  7.184922 0.329784 -3.269641
C  4.747548 0.649745 -3.869015
C  -0.384573 -0.44387 -1.945269
C  -1.215784 -0.306921 -0.719566
C  -1.752526 -1.359154 0.088808
C  -1.603858 0.842049 -0.117619
C  -2.420514 -0.763703 1.104137
C  -3.204731 -1.293276 2.249551
C  -4.658594 -0.888832 2.199193
C  -5.165786 0.054933 3.082267
C  -5.511353 -1.444934 1.250724
C  -6.499786 0.433857 3.026515
C  -6.843923 -1.071383 1.192735
C  -7.342844 -0.129228 2.082121
H  3.808378 2.080977 -1.097598
H  3.38305 -0.968631 -1.266703
H  4.047319 -1.218686 1.662988
H  5.381684 -0.069426 1.657455
H  5.164874 -1.173385 0.302369
H  2.329606 0.70995 1.977412
H  2.371193 2.081917 0.873174
H  3.6867 1.832014 2.014983
H  6.349835 0.755456 -0.79886
H  7.896118 0.281645 -2.446046
H  7.236764 -0.616128 -3.81451
H  7.522904 1.105642 -3.96102
H  5.010821 1.396291 -4.622457
H  4.681731 -0.307331 -4.392817
H  3.757982 0.896624 -3.491757
H  -0.682163 -1.325751 -2.511588
H  -0.498129 0.426503 -2.59304
H  -1.649842 -2.420537 -0.072974
H  -1.42355 1.878764 -0.348616
H  -2.763869 -0.958028 3.193024
H  -3.11514 -2.381544 2.239699
H  -4.51127 0.500952 3.821402
H  -5.125953 -2.173927 0.54727
H  -6.879122 1.171288 3.721743
H  -7.495669 -1.515764 0.451717
H  -8.383568 0.163462 2.037821
totalener: -1079.73218485 hartree
nucrepener: 2050.37138310 hartree
electener: -3130.10356796 hartree
oneelecener: -5539.18249390 hartree
twoeener: 2409.07892594 hartree
kineticenergy: 1074.91691872 hartree
xcener: -106.467006134154 hartree
chargesum: -0.0000000
charge: -0.262123 -0.402369 -0.248604 0.128611 -0.016269 -0.125321 -0.274845 -0.259946 -0.238651 0.359994 -0.007194 -0.211434 -0.224565 0.056398 -0.076768 -0.284586 0.009640 0.210333 -0.127642 0.075037 -0.141588 -0.160214 -0.126470 -0.128296 -0.129346 0.105767 0.086524 0.091339 0.089192 0.085038 0.086683 0.099159 0.083652 0.092631 0.078541 0.083556 0.087309 0.089904 0.086157 0.084168 0.100545 0.112235 0.125461 0.148338 0.096639 0.107951 0.105283 0.109170 0.122843 0.123751 0.124382
qa: -0.2621 -0.4024 -0.2486 0.1286 -0.0163 -0.1253 -0.2748 -0.2599 -0.2387 0.3600 -0.0072 -0.2114 -0.2246 0.0564 -0.0768 -0.2846 0.0096 0.2103 -0.1276 0.0750 -0.1416 -0.1602 -0.1265 -0.1283 -0.1293 0.1058 0.0865 0.0913 0.0892 0.0850 0.0867 0.0992 0.0837 0.0926 0.0785 0.0836 0.0873 0.0899 0.0862 0.0842 0.1005 0.1122 0.1255 0.1483 0.0966 0.1080 0.1053 0.1092 0.1228 0.1238 0.1244
va: 2.1271 2.0968 2.3173 3.7407 3.8161 3.8451 3.9086 3.9027 3.8943 4.1806 3.7380 3.9414 3.9403 3.8820 3.6713 4.0479 3.9710 3.6350 3.8762 3.6315 4.0032 3.9981 3.9643 3.9679 3.9580 1.0265 1.0307 1.0063 1.0017 1.0051 1.0018 1.0216 1.0025 1.0096 1.0098 0.9993 0.9987 1.0017 1.0010 1.0167 0.9933 1.0098 1.0172 1.0141 1.0082 1.0064 1.0120 1.0120 1.0009 1.0005 0.9999
dispcorr: -0.022662486 hartree
energy: -1079.754847339578
dipole: 28.73246 -28.50419 0.22827 -0.42181 -0.29224 -0.71406 -5.22338 5.17524 -0.04814
magnitude: 0.75120 au
magnitude: 1.90940 debye
