program: Orca
programVersion: 5.0.2
elementType: O O O C C C C C C C C C C C C C C C C C C C C C C H H H H H H H H H H H H H H H H H H H H H H H H H H
charge: 0
multiplicity: 1
keywords: wb97x-d3
keywords: def2-TZVPP
keywords: def2/J RIJCOSX
keywords: DEFGRID2
keywords: scfconv7
keywords: smallprint printgap noloewdin
keywords: NOSOSCF
formula: C22H26O3
InChI: InChI=1/C22H26O3/c1-15(2)10-19-20(22(19,3)4)21(23)25-14-17-12-18(24-13-17)11-16-8-6-5-7-9-16/h5-10,12-13,19-20H,11,14H2,1-4H3
51 atoms
O  1.482269 -1.773136 -0.181506
O  2.072115 -0.081317 1.15733
O  -2.276216 0.133737 1.18332
C  4.631516 -0.094309 -0.643082
C  3.720943 1.020802 -1.061468
C  3.169638 -0.377977 -0.94691
C  5.625089 -0.624218 -1.64851
C  5.151806 -0.120619 0.772999
C  3.829944 1.664545 -2.393149
C  2.201866 -0.692419 0.127931
C  4.443735 2.823937 -2.634044
C  4.496097 3.40957 -4.012737
C  5.123573 3.633756 -1.571965
C  0.50975 -2.202529 0.777162
C  -0.741442 -1.399528 0.726821
C  -1.860087 -1.578461 -0.148629
C  -1.061327 -0.339582 1.506247
C  -2.760459 -0.621248 0.175385
C  -4.117313 -0.288809 -0.33259
C  -5.179464 -0.423482 0.731967
C  -5.669868 -1.677269 1.082156
C  -5.660989 0.693628 1.402335
C  -6.626268 -1.811114 2.07566
C  -6.61658 0.563987 2.400018
C  -7.102286 -0.688924 2.739356
H  3.413833 1.673438 -0.249413
H  2.991887 -0.90893 -1.876179
H  5.923523 -1.642733 -1.394333
H  6.52397 -0.00496 -1.657204
H  5.23103 -0.635496 -2.663859
H  5.369513 -1.142024 1.091402
H  4.457857 0.312526 1.488344
H  6.08493 0.443482 0.827487
H  3.3713 1.143883 -3.229005
H  3.987177 2.783106 -4.744003
H  4.032443 4.398629 -4.038753
H  5.528995 3.541988 -4.343775
H  4.658249 4.618022 -1.474319
H  5.106986 3.156821 -0.59423
H  6.169399 3.811246 -1.834724
H  0.937581 -2.188882 1.780681
H  0.306578 -3.239981 0.513241
H  -1.973426 -2.328943 -0.914951
H  -0.527965 0.170888 2.290796
H  -4.333445 -0.955588 -1.169559
H  -4.127792 0.727299 -0.738202
H  -5.295631 -2.558277 0.573856
H  -5.284902 1.675972 1.143484
H  -7.00003 -2.793347 2.333804
H  -6.98006 1.444362 2.913667
H  -7.848347 -0.791768 3.516267
totalener: -1079.73246663 hartree
nucrepener: 2026.47721784 hartree
electener: -3106.20968447 hartree
oneelecener: -5491.43896456 hartree
twoeener: 2385.22928009 hartree
kineticenergy: 1074.91422686 hartree
xcener: -106.466210806143 hartree
chargesum: -0.0000000
charge: -0.264066 -0.409340 -0.249743 0.125126 -0.019528 -0.128504 -0.236461 -0.278399 -0.188575 0.375971 -0.027245 -0.212790 -0.235246 0.056985 -0.078377 -0.282538 0.015471 0.208845 -0.127096 0.088126 -0.167312 -0.145354 -0.123999 -0.125160 -0.131884 0.100359 0.073327 0.091287 0.086438 0.077126 0.086357 0.104563 0.083092 0.086146 0.078199 0.086044 0.083679 0.091399 0.080576 0.083307 0.110966 0.101247 0.124509 0.146963 0.103491 0.099484 0.106894 0.105684 0.122924 0.123008 0.124024
qa: -0.2641 -0.4093 -0.2497 0.1251 -0.0195 -0.1285 -0.2365 -0.2784 -0.1886 0.3760 -0.0272 -0.2128 -0.2352 0.0570 -0.0784 -0.2825 0.0155 0.2088 -0.1271 0.0881 -0.1673 -0.1454 -0.1240 -0.1252 -0.1319 0.1004 0.0733 0.0913 0.0864 0.0771 0.0864 0.1046 0.0831 0.0861 0.0782 0.0860 0.0837 0.0914 0.0806 0.0833 0.1110 0.1012 0.1245 0.1470 0.1035 0.0995 0.1069 0.1057 0.1229 0.1230 0.1240
va: 2.1361 2.0895 2.3202 3.6986 3.7948 3.9406 3.9070 3.9058 3.8748 4.2049 3.7410 3.9407 3.9457 3.8800 3.6698 4.0506 3.9723 3.6419 3.8792 3.6131 4.0032 4.0087 3.9646 3.9605 3.9600 1.0272 1.0387 1.0049 1.0059 1.0082 1.0029 1.0220 1.0018 1.0152 1.0111 0.9976 0.9987 1.0005 1.0121 1.0000 1.0101 0.9942 1.0170 1.0145 1.0084 1.0061 1.0117 1.0131 1.0005 1.0006 1.0000
dispcorr: -0.022001974 hartree
energy: -1079.754468608174
dipole: 29.02622 -28.83992 0.18630 10.47704 -10.70426 -0.22722 -12.47712 11.89071 -0.58641
magnitude: 0.65591 au
magnitude: 1.66718 debye
