program: Orca
programVersion: 5.0.2
elementType: O O O C C C C C C C C C C C C C C C C C C C C C C H H H H H H H H H H H H H H H H H H H H H H H H H H
charge: 0
multiplicity: 1
keywords: wb97x-d3
keywords: def2-TZVPP
keywords: def2/J RIJCOSX
keywords: DEFGRID2
keywords: scfconv7
keywords: smallprint printgap noloewdin
keywords: NOSOSCF
formula: C22H26O3
InChI: InChI=1/C22H26O3/c1-15(2)10-19-20(22(19,3)4)21(23)25-14-17-12-18(24-13-17)11-16-8-6-5-7-9-16/h5-10,12-13,19-20H,11,14H2,1-4H3
51 atoms
O  1.647651 -1.988023 0.436525
O  1.395728 -1.434332 -1.716604
O  -2.652606 -2.168595 -0.316957
C  2.018695 1.422207 -0.564152
C  3.21014 0.877801 -1.295421
C  2.552641 0.039106 -0.230728
C  2.242793 2.483706 0.485264
C  0.717228 1.590031 -1.309028
C  4.579835 1.400033 -1.070851
C  1.810397 -1.180753 -0.614762
C  5.222773 2.248255 -1.874558
C  6.618682 2.702153 -1.572756
C  4.626712 2.812872 -3.127792
C  0.830134 -3.145946 0.237881
C  -0.614381 -2.796102 0.289316
C  -1.422482 -2.630603 1.458256
C  -1.424767 -2.495937 -0.753261
C  -2.647946 -2.248108 1.029944
C  -3.890541 -1.863928 1.745379
C  -4.182976 -0.383798 1.647968
C  -3.260861 0.544272 2.123682
C  -5.366705 0.077422 1.088973
C  -3.521249 1.902115 2.047869
C  -5.631246 1.43819 1.00988
C  -4.709681 2.354282 1.489857
H  2.995663 0.541717 -2.305529
H  3.067284 -0.031603 0.721904
H  3.163327 2.331536 1.047296
H  1.414711 2.501487 1.195806
H  2.306493 3.469302 0.020382
H  -0.135853 1.500746 -0.633963
H  0.586783 0.864614 -2.107407
H  0.679099 2.585778 -1.75461
H  5.094234 1.052802 -0.179139
H  7.30509 2.424984 -2.376713
H  6.668415 3.790172 -1.483907
H  6.998868 2.272102 -0.646961
H  5.208201 2.517174 -4.004596
H  3.596263 2.502794 -3.288259
H  4.642039 3.905135 -3.10115
H  1.094062 -3.816314 1.054994
H  1.085114 -3.639467 -0.700712
H  -1.122028 -2.776475 2.483829
H  -1.256605 -2.462878 -1.816859
H  -3.774716 -2.15179 2.792987
H  -4.741752 -2.434158 1.363323
H  -2.326219 0.198308 2.54968
H  -6.090425 -0.632771 0.707201
H  -2.795326 2.610914 2.424545
H  -6.558161 1.780688 0.568678
H  -4.913098 3.415197 1.428468
totalener: -1079.73266542 hartree
nucrepener: 2100.47225310 hartree
electener: -3180.20491852 hartree
oneelecener: -5639.34953181 hartree
twoeener: 2459.14461329 hartree
kineticenergy: 1074.92445051 hartree
xcener: -106.468488096106 hartree
chargesum: 0.0000000
charge: -0.264168 -0.401641 -0.246699 0.128897 -0.017037 -0.127304 -0.235324 -0.271958 -0.192053 0.362735 -0.027325 -0.212181 -0.236424 0.062211 -0.070726 -0.289338 0.000657 0.217036 -0.119949 0.063018 -0.160732 -0.148808 -0.129168 -0.119876 -0.131797 0.100687 0.072948 0.075801 0.090482 0.086577 0.090068 0.099509 0.082792 0.085072 0.085965 0.083378 0.077397 0.091127 0.081991 0.083372 0.099699 0.113248 0.128227 0.150150 0.107468 0.092732 0.113463 0.105073 0.123578 0.123033 0.124117
qa: -0.2642 -0.4016 -0.2467 0.1289 -0.0170 -0.1273 -0.2353 -0.2720 -0.1921 0.3627 -0.0273 -0.2122 -0.2364 0.0622 -0.0707 -0.2893 0.0007 0.2170 -0.1199 0.0630 -0.1607 -0.1488 -0.1292 -0.1199 -0.1318 0.1007 0.0729 0.0758 0.0905 0.0866 0.0901 0.0995 0.0828 0.0851 0.0860 0.0834 0.0774 0.0911 0.0820 0.0834 0.0997 0.1132 0.1282 0.1502 0.1075 0.0927 0.1135 0.1051 0.1236 0.1230 0.1241
va: 2.1351 2.1000 2.3157 3.7086 3.7872 3.9375 3.9018 3.9104 3.8781 4.2290 3.7429 3.9406 3.9462 3.8732 3.6776 4.0337 3.9719 3.6251 3.8846 3.6667 3.9816 4.0017 3.9668 3.9614 3.9627 1.0267 1.0388 1.0089 1.0052 1.0060 1.0033 1.0218 1.0027 1.0155 0.9975 0.9988 1.0112 1.0001 1.0114 1.0002 0.9944 1.0101 1.0159 1.0143 1.0035 1.0134 1.0128 1.0117 1.0010 1.0008 1.0000
dispcorr: -0.023159809 hartree
energy: -1079.755825232615
dipole: 20.70379 -20.59032 0.11348 21.22760 -20.91781 0.30979 -5.34980 5.93705 0.58725
magnitude: 0.67358 au
magnitude: 1.71212 debye
