program: Orca
programVersion: 5.0.2
elementType: O O O C C C C C C C C C C C C C C C C C C C C C C H H H H H H H H H H H H H H H H H H H H H H H H H H
charge: 0
multiplicity: 1
keywords: wb97x-d3
keywords: def2-TZVPP
keywords: def2/J RIJCOSX
keywords: DEFGRID2
keywords: scfconv7
keywords: smallprint printgap noloewdin
keywords: NOSOSCF
formula: C22H26O3
InChI: InChI=1/C22H26O3/c1-15(2)10-19-20(22(19,3)4)21(23)25-14-17-12-18(24-13-17)11-16-8-6-5-7-9-16/h5-10,12-13,19-20H,11,14H2,1-4H3
51 atoms
O  1.173914 -0.412793 1.164252
O  2.025064 -1.625367 -0.512347
O  -2.286518 -2.339476 -0.768823
C  2.645411 1.213959 -1.690543
C  3.891074 0.610332 -1.11319
C  2.632931 0.6746 -0.272498
C  2.543073 2.714579 -1.830108
C  1.938432 0.474798 -2.800694
C  5.065407 1.416964 -0.730972
C  1.932125 -0.579915 0.078922
C  6.340004 1.181397 -1.051319
C  7.431009 2.095981 -0.577967
C  6.813786 0.029735 -1.885658
C  0.393726 -1.535277 1.590076
C  -0.852984 -1.690017 0.792191
C  -2.114176 -1.050556 1.019217
C  -1.027557 -2.455152 -0.310662
C  -2.945549 -1.483841 0.042898
C  -4.371181 -1.20674 -0.288053
C  -5.00627 -0.289417 0.720087
C  -5.795021 -0.796299 1.745625
C  -4.791123 1.0838 0.658189
C  -6.361274 0.049075 2.688717
C  -5.352476 1.932012 1.599833
C  -6.141093 1.415976 2.618334
H  4.103703 -0.385817 -1.48508
H  2.607974 1.431969 0.503507
H  2.986077 3.252743 -0.993351
H  1.497414 3.019429 -1.898116
H  3.047834 3.047883 -2.738559
H  0.86568 0.675789 -2.781886
H  2.075671 -0.601768 -2.7479
H  2.320826 0.814211 -3.764799
H  4.862859 2.291702 -0.11953
H  7.984928 2.517403 -1.420442
H  7.045666 2.923803 0.015892
H  8.158724 1.55663 0.033324
H  7.534481 -0.576634 -1.331979
H  6.014738 -0.628026 -2.218349
H  7.333419 0.391027 -2.776485
H  0.153956 -1.324832 2.63167
H  0.992998 -2.446136 1.559149
H  -2.364977 -0.364595 1.812034
H  -0.36145 -3.098504 -0.861106
H  -4.92697 -2.147951 -0.337335
H  -4.437832 -0.766442 -1.288531
H  -5.969024 -1.863923 1.807487
H  -4.174988 1.491659 -0.134457
H  -6.976299 -0.361635 3.478728
H  -5.176711 2.997886 1.536424
H  -6.583726 2.076749 3.351984
totalener: -1079.73407176 hartree
nucrepener: 2046.87224397 hartree
electener: -3126.60631574 hartree
oneelecener: -5532.06720682 hartree
twoeener: 2405.46089109 hartree
kineticenergy: 1074.90562847 hartree
xcener: -106.467176295074 hartree
chargesum: -0.0000000
charge: -0.263358 -0.407565 -0.255333 0.090764 0.041993 -0.100129 -0.245092 -0.260353 -0.185686 0.363638 -0.051060 -0.204566 -0.235933 0.062080 -0.092836 -0.239886 0.005584 0.162970 -0.053043 0.026912 -0.148230 -0.176747 -0.123369 -0.118353 -0.130132 0.088316 0.070230 0.070191 0.090854 0.091604 0.086612 0.098064 0.084464 0.070553 0.082975 0.076256 0.084684 0.085790 0.083489 0.084604 0.100439 0.112915 0.137754 0.150377 0.088582 0.098017 0.108615 0.115633 0.125076 0.125401 0.126237
qa: -0.2634 -0.4076 -0.2553 0.0908 0.0420 -0.1001 -0.2451 -0.2604 -0.1857 0.3636 -0.0511 -0.2046 -0.2359 0.0621 -0.0928 -0.2399 0.0056 0.1630 -0.0530 0.0269 -0.1482 -0.1767 -0.1234 -0.1184 -0.1301 0.0883 0.0702 0.0702 0.0909 0.0916 0.0866 0.0981 0.0845 0.0706 0.0830 0.0763 0.0847 0.0858 0.0835 0.0846 0.1004 0.1129 0.1378 0.1504 0.0886 0.0980 0.1086 0.1156 0.1251 0.1254 0.1262
va: 2.1383 2.0928 2.3058 3.7371 3.7789 3.8931 3.9140 3.9144 3.8986 4.2167 3.8249 3.9352 3.9460 3.8667 3.6940 4.0129 3.9687 3.7088 3.8614 3.6647 3.9891 3.9772 3.9626 3.9521 3.9562 1.0361 1.0384 1.0111 1.0041 1.0042 1.0023 1.0230 1.0013 1.0213 0.9983 1.0123 0.9981 0.9991 1.0158 0.9994 0.9948 1.0094 1.0084 1.0150 1.0115 1.0035 1.0114 1.0097 1.0005 1.0001 0.9996
dispcorr: -0.021948609 hartree
energy: -1079.756020371555
dipole: 26.43865 -26.56227 -0.12363 13.74011 -13.14544 0.59466 -9.53509 9.77881 0.24372
magnitude: 0.65445 au
magnitude: 1.66349 debye
