program: Orca
programVersion: 5.0.2
elementType: O O O C C C C C C C C C C C C C C C C C C C C C C H H H H H H H H H H H H H H H H H H H H H H H H H H
charge: 0
multiplicity: 1
keywords: wb97x-d3
keywords: def2-TZVPP
keywords: def2/J RIJCOSX
keywords: DEFGRID2
keywords: scfconv7
keywords: smallprint printgap noloewdin
keywords: NOSOSCF
formula: C22H26O3
InChI: InChI=1/C22H26O3/c1-15(2)10-19-20(22(19,3)4)21(23)25-14-17-12-18(24-13-17)11-16-8-6-5-7-9-16/h5-10,12-13,19-20H,11,14H2,1-4H3
51 atoms
O  1.531343 -1.796059 -1.01418
O  2.369062 -2.015757 1.048193
O  -1.925105 -2.523245 1.520567
C  1.785185 1.223939 -0.228829
C  2.68734 0.823159 -1.362557
C  2.709557 0.027481 -0.085301
C  2.147238 2.441134 0.586102
C  0.294447 1.031177 -0.37064
C  3.880543 1.625383 -1.735179
C  2.199488 -1.355628 0.057107
C  3.904614 2.575795 -2.670568
C  5.163455 3.321783 -2.994467
C  2.700485 2.973774 -3.469265
C  0.80565 -3.021543 -0.861653
C  -0.466478 -2.786283 -0.128336
C  -1.684242 -2.25276 -0.658647
C  -0.682285 -2.923493 1.201081
C  -2.53037 -2.109709 0.387642
C  -3.891126 -1.526249 0.514561
C  -3.850242 -0.179953 1.19938
C  -3.408824 0.942367 0.505745
C  -4.202772 -0.044362 2.535597
C  -3.326203 2.175058 1.132132
C  -4.119587 1.188497 3.167838
C  -3.681568 2.301573 2.468007
H  2.178944 0.340863 -2.191511
H  3.555353 0.19943 0.572464
H  1.794348 3.348894 0.092336
H  3.222188 2.546641 0.726291
H  1.682009 2.394165 1.572073
H  -0.17295 0.821829 0.59342
H  0.030286 0.221276 -1.046059
H  -0.157941 1.946376 -0.759293
H  4.802033 1.407908 -1.202553
H  6.00372 2.99003 -2.385787
H  5.439627 3.192965 -4.044122
H  5.036377 4.395604 -2.835987
H  2.850942 2.767362 -4.531963
H  1.793858 2.461952 -3.152371
H  2.520744 4.048334 -3.385969
H  1.419897 -3.772581 -0.36419
H  0.613119 -3.360201 -1.878999
H  -1.892974 -2.002183 -1.686842
H  -0.054127 -3.265616 2.006748
H  -4.549432 -2.206085 1.061978
H  -4.31164 -1.426666 -0.487998
H  -3.117284 0.847545 -0.533991
H  -4.542316 -0.910862 3.090006
H  -2.982299 3.038621 0.577864
H  -4.396368 1.277792 4.21017
H  -3.616997 3.263232 2.959668
totalener: -1079.72886044 hartree
nucrepener: 2160.03199435 hartree
electener: -3239.76085479 hartree
oneelecener: -5758.30511838 hartree
twoeener: 2518.54426359 hartree
kineticenergy: 1074.91541624 hartree
xcener: -106.466916969721 hartree
chargesum: -0.0000000
charge: -0.266351 -0.373943 -0.248396 0.159275 0.012450 -0.125361 -0.244704 -0.326395 -0.216339 0.344678 -0.024453 -0.212431 -0.236154 0.039732 -0.052164 -0.344234 0.008628 0.246520 -0.129154 0.119435 -0.217213 -0.154662 -0.112954 -0.118836 -0.132494 0.098148 0.078538 0.082991 0.079783 0.097504 0.116064 0.087660 0.082546 0.089600 0.079437 0.085464 0.083590 0.093523 0.078161 0.084172 0.114855 0.099401 0.127981 0.151757 0.099712 0.106735 0.109131 0.107234 0.122876 0.123928 0.124724
qa: -0.2664 -0.3739 -0.2484 0.1593 0.0125 -0.1254 -0.2447 -0.3264 -0.2163 0.3447 -0.0245 -0.2124 -0.2362 0.0397 -0.0522 -0.3442 0.0086 0.2465 -0.1292 0.1194 -0.2172 -0.1547 -0.1130 -0.1188 -0.1325 0.0981 0.0785 0.0830 0.0798 0.0975 0.1161 0.0877 0.0825 0.0896 0.0794 0.0855 0.0836 0.0935 0.0782 0.0842 0.1149 0.0994 0.1280 0.1518 0.0997 0.1067 0.1091 0.1072 0.1229 0.1239 0.1247
va: 2.1027 2.1270 2.3145 3.6956 3.7648 3.9145 3.9002 3.9185 3.8709 4.2744 3.7369 3.9414 3.9431 3.8898 3.6625 4.0216 3.9837 3.5912 3.8768 3.5728 3.9892 4.0206 3.9355 3.9569 3.9690 1.0213 1.0347 1.0040 1.0084 1.0046 0.9920 1.0150 1.0032 1.0149 1.0109 0.9976 0.9988 1.0006 1.0109 1.0006 1.0100 0.9955 1.0168 1.0124 1.0119 1.0085 1.0092 1.0127 1.0008 1.0002 0.9994
dispcorr: -0.026166285 hartree
energy: -1079.755026721271
dipole: 12.21886 -12.71895 -0.50009 22.88965 -22.27385 0.61580 -12.34160 11.54285 -0.79875
magnitude: 1.12574 au
magnitude: 2.86141 debye
