program: Orca
programVersion: 5.0.2
elementType: O O O C C C C C C C C C C C C C C C C C C C C C C H H H H H H H H H H H H H H H H H H H H H H H H H H
charge: 0
multiplicity: 1
keywords: wb97x-d3
keywords: def2-TZVPP
keywords: def2/J RIJCOSX
keywords: DEFGRID2
keywords: scfconv7
keywords: smallprint printgap noloewdin
keywords: NOSOSCF
formula: C22H26O3
InChI: InChI=1/C22H26O3/c1-15(2)10-19-20(22(19,3)4)21(23)25-14-17-12-18(24-13-17)11-16-8-6-5-7-9-16/h5-10,12-13,19-20H,11,14H2,1-4H3
51 atoms
O  1.05345 -1.282737 -0.438352
O  2.276617 -0.468673 1.24685
O  -1.870751 0.511721 2.287362
C  4.391569 -0.116572 -1.043481
C  3.774516 1.199004 -0.678504
C  2.878668 0.034155 -1.010467
C  5.005193 -0.26386 -2.414549
C  5.111707 -0.90876 0.019639
C  3.822276 2.379965 -1.578279
C  2.065247 -0.575887 0.064994
C  4.836676 3.243614 -1.638095
C  4.799664 4.437575 -2.542954
C  6.07896 3.106129 -0.811243
C  0.18892 -1.936408 0.498001
C  -0.848687 -1.02761 1.062319
C  -2.22578 -0.960262 0.679372
C  -0.701233 -0.106996 2.046523
C  -2.798145 -0.011959 1.457683
C  -4.181644 0.533302 1.548163
C  -5.198008 -0.414064 0.968399
C  -5.859054 -0.127212 -0.218578
C  -5.487932 -1.608922 1.622379
C  -6.793478 -1.011185 -0.742831
C  -6.419328 -2.492589 1.104313
C  -7.07639 -2.195445 -0.08253
H  3.806825 1.425666 0.384157
H  2.400139 0.044465 -1.984198
H  5.043728 -1.314235 -2.708526
H  6.027074 0.12089 -2.416456
H  4.453991 0.280518 -3.180071
H  4.709641 -0.745054 1.016115
H  6.166485 -0.625933 0.03379
H  5.065227 -1.979172 -0.191005
H  2.956041 2.554808 -2.209945
H  5.640263 4.428091 -3.241277
H  3.879676 4.48348 -3.124361
H  4.881215 5.365537 -1.971507
H  6.197348 3.963168 -0.143304
H  6.085741 2.204167 -0.202089
H  6.967049 3.086415 -1.447711
H  0.77926 -2.399544 1.289704
H  -0.28656 -2.731075 -0.075514
H  -2.723629 -1.554611 -0.070101
H  0.145458 0.201038 2.636227
H  -4.24033 1.49951 1.036864
H  -4.419505 0.734964 2.596979
H  -5.644042 0.797187 -0.74138
H  -4.974122 -1.848675 2.54579
H  -7.300405 -0.770881 -1.668238
H  -6.635309 -3.414818 1.627737
H  -7.805533 -2.884469 -0.487889
totalener: -1079.73228249 hartree
nucrepener: 2027.57539943 hartree
electener: -3107.30768191 hartree
oneelecener: -5493.52076809 hartree
twoeener: 2386.21308617 hartree
kineticenergy: 1074.90220269 hartree
xcener: -106.465259074491 hartree
chargesum: -0.0000000
charge: -0.262121 -0.418043 -0.253185 0.080342 -0.029245 -0.093154 -0.244832 -0.272345 -0.187393 0.365214 -0.028935 -0.211457 -0.236977 0.070550 -0.086679 -0.250985 -0.001142 0.165539 -0.063611 0.011797 -0.136897 -0.170547 -0.122986 -0.113163 -0.132751 0.106029 0.078684 0.094224 0.085695 0.082180 0.105552 0.080940 0.088952 0.090763 0.083465 0.079015 0.086013 0.096259 0.081616 0.085174 0.115116 0.099079 0.138027 0.156303 0.084262 0.105086 0.108370 0.116743 0.124517 0.125399 0.125541
qa: -0.2621 -0.4180 -0.2532 0.0803 -0.0292 -0.0932 -0.2448 -0.2723 -0.1874 0.3652 -0.0289 -0.2115 -0.2370 0.0705 -0.0867 -0.2510 -0.0011 0.1655 -0.0636 0.0118 -0.1369 -0.1705 -0.1230 -0.1132 -0.1328 0.1060 0.0787 0.0942 0.0857 0.0822 0.1056 0.0809 0.0890 0.0908 0.0835 0.0790 0.0860 0.0963 0.0816 0.0852 0.1151 0.0991 0.1380 0.1563 0.0843 0.1051 0.1084 0.1167 0.1245 0.1254 0.1255
va: 2.1427 2.0735 2.3116 3.7163 3.8134 3.8872 3.9099 3.9034 3.8543 4.2215 3.7393 3.9402 3.9376 3.8430 3.7080 4.0218 3.9632 3.6918 3.8355 3.6830 3.9661 3.9873 3.9623 3.9441 3.9577 1.0283 1.0347 1.0056 1.0027 1.0072 1.0208 1.0023 1.0027 1.0132 0.9991 1.0106 0.9979 1.0023 1.0112 0.9999 1.0082 0.9978 1.0085 1.0147 1.0068 1.0068 1.0113 1.0083 1.0006 0.9998 0.9998
dispcorr: -0.022529508 hartree
energy: -1079.754811994588
dipole: 29.33588 -29.36317 -0.02729 9.84522 -9.89305 -0.04784 -13.05234 12.40013 -0.65221
magnitude: 0.65453 au
magnitude: 1.66369 debye
