program: Orca
programVersion: 5.0.2
elementType: O O O C C C C C C C C C C C C C C C C C C C C C C H H H H H H H H H H H H H H H H H H H H H H H H H H
charge: 0
multiplicity: 1
keywords: wb97x-d3
keywords: def2-TZVPP
keywords: def2/J RIJCOSX
keywords: DEFGRID2
keywords: scfconv7
keywords: smallprint printgap noloewdin
keywords: NOSOSCF
formula: C22H26O3
InChI: InChI=1/C22H26O3/c1-15(2)10-19-20(22(19,3)4)21(23)25-14-17-12-18(24-13-17)11-16-8-6-5-7-9-16/h5-10,12-13,19-20H,11,14H2,1-4H3
51 atoms
O  1.086906 -1.300403 -1.566277
O  0.949258 0.928476 -1.413022
O  -2.507481 -2.144406 0.92709
C  3.544537 0.486315 0.303529
C  3.883879 1.06261 -1.03942
C  3.019255 -0.175775 -0.957249
C  4.593396 -0.28386 1.069203
C  2.613951 1.261458 1.204923
C  5.232751 0.974715 -1.629533
C  1.590713 -0.088189 -1.330981
C  5.936926 1.97445 -2.16537
C  7.300242 1.730026 -2.741483
C  5.47388 3.397443 -2.248493
C  -0.30455 -1.390602 -1.892164
C  -1.168522 -1.403297 -0.681317
C  -1.512606 -0.313307 0.181995
C  -1.805439 -2.481862 -0.168066
C  -2.323274 -0.823215 1.137444
C  -3.034225 -0.209786 2.289381
C  -4.530482 -0.172158 2.09055
C  -5.341265 -1.187798 2.582078
C  -5.118479 0.869608 1.381344
C  -6.712565 -1.162199 2.373437
C  -6.488246 0.900336 1.172877
C  -7.290428 -0.117102 1.669172
H  3.322603 1.9577 -1.283627
H  3.491181 -1.119941 -1.207173
H  5.246467 0.400319 1.613721
H  5.224701 -0.897933 0.428742
H  4.122421 -0.946707 1.797028
H  2.037518 0.58725 1.841694
H  1.9123 1.883505 0.655176
H  3.196542 1.913996 1.85776
H  5.690063 -0.010517 -1.629499
H  7.60464 0.688054 -2.650522
H  7.332666 1.996961 -3.800842
H  8.05446 2.344442 -2.243323
H  6.162345 4.054738 -1.71145
H  5.463996 3.740717 -3.285872
H  4.480417 3.560574 -1.837628
H  -0.404122 -2.330999 -2.433715
H  -0.587473 -0.580709 -2.566399
H  -1.193332 0.710949 0.089012
H  -1.847871 -3.515401 -0.472961
H  -2.647449 0.802718 2.417607
H  -2.794614 -0.750984 3.209338
H  -4.897062 -2.007892 3.133191
H  -4.496865 1.664535 0.985873
H  -7.330627 -1.960569 2.763084
H  -6.930616 1.721184 0.623589
H  -8.360183 -0.094151 1.508392
totalener: -1079.73357965 hartree
nucrepener: 2040.43944928 hartree
electener: -3120.17302893 hartree
oneelecener: -5519.22098737 hartree
twoeener: 2399.04795845 hartree
kineticenergy: 1074.91015242 hartree
xcener: -106.466755076541 hartree
chargesum: -0.0000000
charge: -0.258177 -0.407952 -0.253773 0.095455 0.041350 -0.096311 -0.245519 -0.266094 -0.186573 0.366338 -0.052002 -0.204025 -0.235809 0.051243 -0.062530 -0.276010 -0.034608 0.232393 -0.136983 0.093778 -0.154325 -0.168751 -0.124121 -0.121618 -0.135309 0.088668 0.071237 0.091649 0.069580 0.092369 0.087674 0.095431 0.086298 0.071313 0.076216 0.084663 0.083182 0.084708 0.085773 0.083148 0.093686 0.115019 0.151102 0.134222 0.104072 0.103431 0.106366 0.109000 0.123287 0.123678 0.124160
qa: -0.2582 -0.4080 -0.2538 0.0955 0.0414 -0.0963 -0.2455 -0.2661 -0.1866 0.3663 -0.0520 -0.2040 -0.2358 0.0512 -0.0625 -0.2760 -0.0346 0.2324 -0.1370 0.0938 -0.1543 -0.1688 -0.1241 -0.1216 -0.1353 0.0887 0.0712 0.0916 0.0696 0.0924 0.0877 0.0954 0.0863 0.0713 0.0762 0.0847 0.0832 0.0847 0.0858 0.0831 0.0937 0.1150 0.1511 0.1342 0.1041 0.1034 0.1064 0.1090 0.1233 0.1237 0.1242
va: 2.1360 2.0919 2.3145 3.7348 3.7792 3.8931 3.9120 3.9143 3.8990 4.2130 3.8249 3.9351 3.9461 3.9044 3.7296 4.0221 4.0004 3.6072 3.8844 3.6066 4.0131 4.0058 3.9572 3.9627 3.9624 1.0360 1.0380 1.0041 1.0112 1.0038 1.0026 1.0210 1.0026 1.0212 1.0122 0.9982 0.9983 0.9992 0.9992 1.0158 0.9979 1.0052 1.0218 1.0070 1.0103 1.0072 1.0145 1.0113 1.0003 1.0004 1.0000
dispcorr: -0.022015208 hartree
energy: -1079.755594857178
dipole: 30.21868 -29.82170 0.39698 12.35259 -12.58251 -0.22992 -1.81893 1.94034 0.12140
magnitude: 0.47455 au
magnitude: 1.20620 debye
