program: Orca
programVersion: 5.0.2
elementType: O O O C C C C C C C C C C C C C C C C C C C C C C H H H H H H H H H H H H H H H H H H H H H H H H H H
charge: 0
multiplicity: 1
keywords: wb97x-d3
keywords: def2-TZVPP
keywords: def2/J RIJCOSX
keywords: DEFGRID2
keywords: scfconv7
keywords: smallprint printgap noloewdin
keywords: NOSOSCF
formula: C22H26O3
InChI: InChI=1/C22H26O3/c1-15(2)10-19-20(22(19,3)4)21(23)25-14-17-12-18(24-13-17)11-16-8-6-5-7-9-16/h5-10,12-13,19-20H,11,14H2,1-4H3
51 atoms
O  1.897214 -2.324635 0.376872
O  1.491651 -1.700341 -1.733669
O  -2.391807 -2.600659 -0.314209
C  1.377848 1.064189 -0.190862
C  2.542304 1.008704 -1.139508
C  2.343533 -0.111782 -0.161348
C  1.447631 2.00746 0.984121
C  -0.020595 0.895022 -0.733933
C  3.715009 1.908625 -1.003331
C  1.879484 -1.436481 -0.626636
C  3.862654 3.069836 -1.642365
C  5.100445 3.899595 -1.483439
C  2.82977 3.632991 -2.57059
C  1.115365 -3.507828 0.189743
C  -0.327691 -3.158351 0.271353
C  -1.019651 -2.652765 1.417836
C  -1.216517 -3.091734 -0.745583
C  -2.263923 -2.324163 1.001737
C  -3.403007 -1.638698 1.668678
C  -3.377579 -0.152203 1.395762
C  -2.778322 0.719138 2.298695
C  -3.899614 0.363925 0.214612
C  -2.702081 2.077708 2.031071
C  -3.82468 1.721898 -0.056626
C  -3.225447 2.583349 0.850709
H  2.272906 0.749147 -2.159566
H  2.996863 -0.140954 0.704986
H  1.165111 3.016778 0.67803
H  2.445825 2.066855 1.416577
H  0.755819 1.691398 1.766893
H  -0.681716 0.443661 0.008923
H  -0.055507 0.283018 -1.632115
H  -0.438907 1.872472 -0.981377
H  4.51385 1.58118 -0.343682
H  5.618217 4.017806 -2.438914
H  4.859407 4.906757 -1.134473
H  5.802466 3.458195 -0.777069
H  3.220611 3.712847 -3.588446
H  1.92027 3.036607 -2.605994
H  2.551036 4.64515 -2.266885
H  1.415052 -4.171331 1.000413
H  1.354949 -3.995787 -0.756323
H  -0.624709 -2.529628 2.413638
H  -1.140616 -3.334286 -1.79267
H  -3.33673 -1.820793 2.742483
H  -4.350753 -2.070074 1.336559
H  -2.364151 0.330578 3.221818
H  -4.364904 -0.301547 -0.502422
H  -2.235345 2.742209 2.746539
H  -4.236629 2.108395 -0.979737
H  -3.168821 3.643223 0.640316
totalener: -1079.72990323 hartree
nucrepener: 2202.90715390 hartree
electener: -3282.63705713 hartree
oneelecener: -5844.34102200 hartree
twoeener: 2561.70396488 hartree
kineticenergy: 1074.91575927 hartree
xcener: -106.467250523758 hartree
chargesum: 0.0000000
charge: -0.266309 -0.378850 -0.251695 0.168434 -0.030551 -0.106247 -0.250659 -0.262025 -0.195822 0.324111 -0.025863 -0.213155 -0.234280 0.066682 -0.064366 -0.281586 0.005565 0.219621 -0.137216 0.070463 -0.149259 -0.144425 -0.137527 -0.122927 -0.134052 0.103923 0.073567 0.086001 0.080887 0.085768 0.058826 0.102372 0.085175 0.085926 0.086401 0.081879 0.078195 0.093128 0.081103 0.081987 0.103808 0.105447 0.122037 0.141136 0.097785 0.109165 0.101951 0.111910 0.125222 0.123626 0.124712
qa: -0.2663 -0.3789 -0.2517 0.1684 -0.0306 -0.1062 -0.2507 -0.2620 -0.1958 0.3241 -0.0259 -0.2132 -0.2343 0.0667 -0.0644 -0.2816 0.0056 0.2196 -0.1372 0.0705 -0.1493 -0.1444 -0.1375 -0.1229 -0.1341 0.1039 0.0736 0.0860 0.0809 0.0858 0.0588 0.1024 0.0852 0.0859 0.0864 0.0819 0.0782 0.0931 0.0811 0.0820 0.1038 0.1054 0.1220 0.1411 0.0978 0.1092 0.1020 0.1119 0.1252 0.1236 0.1247
va: 2.1118 2.1261 2.2997 3.6615 3.8202 3.8916 3.9049 3.9107 3.8653 4.2951 3.7357 3.9412 3.9414 3.8997 3.7079 4.0221 3.9721 3.6051 3.8733 3.6229 3.9449 3.9834 3.9339 3.9479 3.9261 1.0254 1.0367 1.0045 1.0104 1.0079 1.0068 1.0253 1.0053 1.0146 0.9971 0.9993 1.0108 1.0005 1.0121 1.0005 0.9912 1.0101 1.0204 1.0118 1.0131 1.0121 1.0125 1.0177 1.0003 1.0006 1.0001
dispcorr: -0.027825185 hartree
energy: -1079.757728414825
dipole: 12.48652 -12.66637 -0.17985 24.04059 -23.62752 0.41306 -2.64360 3.31505 0.67146
magnitude: 0.80859 au
magnitude: 2.05528 debye
