program: Orca
programVersion: 5.0.2
elementType: O O O C C C C C C C C C C C C C C C C C C C C C C H H H H H H H H H H H H H H H H H H H H H H H H H H
charge: 0
multiplicity: 1
keywords: wb97x-d3
keywords: def2-TZVPP
keywords: def2/J RIJCOSX
keywords: DEFGRID2
keywords: scfconv7
keywords: smallprint printgap noloewdin
keywords: NOSOSCF
formula: C22H26O3
InChI: InChI=1/C22H26O3/c1-15(2)10-19-20(22(19,3)4)21(23)25-14-17-12-18(24-13-17)11-16-8-6-5-7-9-16/h5-10,12-13,19-20H,11,14H2,1-4H3
51 atoms
O  1.571341 -1.702932 0.414152
O  1.299905 -0.929684 -1.669432
O  -2.736303 -2.438524 1.223242
C  2.272828 1.741548 -0.368029
C  3.400128 1.103216 -1.121589
C  2.627004 0.291042 -0.100522
C  2.568568 2.71065 0.752311
C  1.014746 2.094769 -1.124962
C  4.81687 1.42322 -0.875327
C  1.767461 -0.818407 -0.564283
C  5.790036 1.514556 -1.785068
C  7.19271 1.850039 -1.373608
C  5.612483 1.307672 -3.25832
C  0.732628 -2.829781 0.136993
C  -0.708989 -2.515651 0.321784
C  -1.574222 -1.760756 -0.534365
C  -1.480719 -2.892296 1.368415
C  -2.787939 -1.747915 0.063686
C  -4.084437 -1.12167 -0.300684
C  -4.541585 -0.096441 0.709145
C  -5.685004 -0.30405 1.467723
C  -3.812076 1.072684 0.902501
C  -6.099025 0.6373 2.39975
C  -4.222509 2.015547 1.829757
C  -5.368994 1.800137 2.582735
H  3.146354 0.847598 -2.144135
H  3.120675 0.108082 0.847413
H  3.412661 2.408982 1.370814
H  1.702393 2.800911 1.40987
H  2.790063 3.702158 0.353567
H  1.069763 3.131711 -1.460536
H  0.13593 2.002071 -0.48314
H  0.857369 1.469172 -1.999087
H  5.092123 1.593537 0.161207
H  7.888241 1.059643 -1.66703
H  7.537722 2.76453 -1.8629
H  7.283702 1.992396 -0.297499
H  5.885081 2.211786 -3.807804
H  6.275123 0.516565 -3.61694
H  4.598749 1.041248 -3.546643
H  1.046044 -3.59243 0.849636
H  0.926894 -3.206065 -0.868583
H  -1.312357 -1.295755 -1.470022
H  -1.272167 -3.470651 2.25448
H  -4.854534 -1.889557 -0.418706
H  -3.963093 -0.656777 -1.281461
H  -6.258394 -1.213046 1.331532
H  -2.910109 1.240791 0.32524
H  -6.991731 0.458591 2.984563
H  -3.646013 2.920971 1.967236
H  -5.68927 2.53574 3.308578
totalener: -1079.73362278 hartree
nucrepener: 2073.94126836 hartree
electener: -3153.67489113 hartree
oneelecener: -5586.16690514 hartree
twoeener: 2432.49201401 hartree
kineticenergy: 1074.92157757 hartree
xcener: -106.469351438074 hartree
chargesum: 0.0000000
charge: -0.258574 -0.409979 -0.249071 0.088806 0.039816 -0.078647 -0.255014 -0.264949 -0.184737 0.366367 -0.053748 -0.202405 -0.237261 0.051838 -0.060009 -0.273407 -0.036779 0.214893 -0.124522 0.057957 -0.130287 -0.149024 -0.130250 -0.136368 -0.123635 0.088411 0.071409 0.072138 0.091278 0.093448 0.086865 0.083774 0.098483 0.069936 0.083694 0.083516 0.075682 0.085818 0.084883 0.084466 0.094104 0.114904 0.152626 0.134337 0.092679 0.111415 0.103575 0.113594 0.122583 0.121804 0.123565
qa: -0.2586 -0.4100 -0.2491 0.0888 0.0398 -0.0786 -0.2550 -0.2649 -0.1847 0.3664 -0.0537 -0.2024 -0.2373 0.0518 -0.0600 -0.2734 -0.0368 0.2149 -0.1245 0.0580 -0.1303 -0.1490 -0.1303 -0.1364 -0.1236 0.0884 0.0714 0.0721 0.0913 0.0934 0.0869 0.0838 0.0985 0.0699 0.0837 0.0835 0.0757 0.0858 0.0849 0.0845 0.0941 0.1149 0.1526 0.1343 0.0927 0.1114 0.1036 0.1136 0.1226 0.1218 0.1236
va: 2.1358 2.0906 2.3143 3.7270 3.7934 3.8619 3.9180 3.9180 3.9100 4.2097 3.8304 3.9335 3.9442 3.9055 3.7200 4.0112 4.0036 3.6167 3.8729 3.6525 3.9866 3.9870 3.9689 3.9736 3.9558 1.0314 1.0370 1.0113 1.0034 1.0029 1.0022 1.0005 1.0216 1.0223 0.9985 0.9979 1.0124 0.9987 0.9993 1.0165 0.9979 1.0055 1.0215 1.0075 1.0089 1.0050 1.0117 1.0063 1.0010 1.0012 0.9998
dispcorr: -0.022256063 hartree
energy: -1079.755878838465
dipole: 24.46377 -24.18858 0.27519 17.89443 -17.72571 0.16872 -7.65751 7.95558 0.29807
magnitude: 0.43937 au
magnitude: 1.11678 debye
