program: Orca
programVersion: 5.0.2
elementType: O O O C C C C C C C C C C C C C C C C C C C C C C H H H H H H H H H H H H H H H H H H H H H H H H H H
charge: 0
multiplicity: 1
keywords: wb97x-d3
keywords: def2-TZVPP
keywords: def2/J RIJCOSX
keywords: DEFGRID2
keywords: scfconv7
keywords: smallprint printgap noloewdin
keywords: NOSOSCF
formula: C22H26O3
InChI: InChI=1/C22H26O3/c1-15(2)10-19-20(22(19,3)4)21(23)25-14-17-12-18(24-13-17)11-16-8-6-5-7-9-16/h5-10,12-13,19-20H,11,14H2,1-4H3
51 atoms
O  0.853658 -1.291511 -1.330653
O  2.208067 -1.803639 0.374604
O  -1.794008 -1.914667 2.134782
C  4.151372 0.163031 -1.107314
C  3.503867 0.858249 0.049942
C  2.638893 0.138654 -0.953691
C  4.670159 0.997534 -2.253436
C  4.977459 -1.072432 -0.846465
C  3.426094 2.338479 0.15777
C  1.909273 -1.080956 -0.541495
C  4.434033 3.128808 0.528168
C  4.267207 4.614114 0.635128
C  5.797394 2.610784 0.871747
C  0.012534 -2.40435 -1.009446
C  -0.922441 -2.092312 0.104471
C  -2.179415 -1.412568 0.015728
C  -0.748473 -2.36494 1.418649
C  -2.662886 -1.335211 1.277288
C  -3.905863 -0.757153 1.859401
C  -4.79243 -0.179997 0.790679
C  -5.788756 -0.950833 0.202965
C  -4.605854 1.123879 0.344042
C  -6.586151 -0.430997 -0.805692
C  -5.39923 1.647242 -0.665614
C  -6.393345 0.870969 -1.243039
H  3.596129 0.328389 0.995152
H  2.102557 0.76055 -1.662607
H  5.683515 1.346953 -2.045095
H  4.056314 1.877467 -2.439853
H  4.703551 0.408262 -3.171497
H  4.986932 -1.728596 -1.719042
H  4.62099 -1.648989 0.002979
H  6.011466 -0.783924 -0.644864
H  2.466032 2.795556 -0.064799
H  3.257475 4.932851 0.379613
H  4.483062 4.962963 1.647971
H  4.962852 5.134978 -0.027815
H  6.560239 3.078724 0.244366
H  6.054988 2.856672 1.905112
H  5.882084 1.532177 0.754971
H  0.615881 -3.283644 -0.780249
H  -0.540424 -2.604185 -1.92667
H  -2.656902 -1.036185 -0.874513
H  0.050648 -2.840907 1.962404
H  -3.646387 0.015952 2.589867
H  -4.445952 -1.528248 2.417478
H  -5.941498 -1.969947 0.537879
H  -3.829214 1.734296 0.789362
H  -7.36022 -1.043638 -1.248957
H  -5.242575 2.664336 -1.000413
H  -7.015491 1.279483 -2.028379
totalener: -1079.73280364 hartree
nucrepener: 2054.56556055 hartree
electener: -3134.29836418 hartree
oneelecener: -5547.53747308 hartree
twoeener: 2413.23910890 hartree
kineticenergy: 1074.90990139 hartree
xcener: -106.466554103461 hartree
chargesum: -0.0000000
charge: -0.264680 -0.409243 -0.255255 0.065379 -0.030008 -0.090252 -0.246212 -0.264656 -0.187226 0.366614 -0.023231 -0.211254 -0.243897 0.064673 -0.094454 -0.243182 0.009247 0.163588 -0.050362 0.019142 -0.151914 -0.159795 -0.124478 -0.122962 -0.128159 0.107793 0.079263 0.083667 0.082845 0.095867 0.087394 0.105359 0.078756 0.089922 0.079022 0.086209 0.083908 0.086878 0.097666 0.083455 0.110344 0.102925 0.136875 0.149243 0.094639 0.090974 0.109528 0.112820 0.125532 0.125295 0.126398
qa: -0.2647 -0.4092 -0.2553 0.0654 -0.0300 -0.0903 -0.2462 -0.2647 -0.1872 0.3666 -0.0232 -0.2113 -0.2439 0.0647 -0.0945 -0.2432 0.0092 0.1636 -0.0504 0.0191 -0.1519 -0.1598 -0.1245 -0.1230 -0.1282 0.1078 0.0793 0.0837 0.0828 0.0959 0.0874 0.1054 0.0788 0.0899 0.0790 0.0862 0.0839 0.0869 0.0977 0.0835 0.1103 0.1029 0.1369 0.1492 0.0946 0.0910 0.1095 0.1128 0.1255 0.1253 0.1264
va: 2.1358 2.0893 2.3068 3.7280 3.8212 3.8563 3.9091 3.9019 3.8586 4.2222 3.7350 3.9381 3.9358 3.8631 3.6978 4.0119 3.9714 3.7036 3.8598 3.6733 3.9847 3.9801 3.9614 3.9571 3.9546 1.0271 1.0348 1.0021 1.0071 1.0061 1.0028 1.0226 1.0026 1.0127 1.0105 0.9981 0.9988 0.9990 1.0036 1.0113 1.0111 0.9940 1.0086 1.0144 1.0055 1.0088 1.0112 1.0108 1.0004 1.0003 0.9996
dispcorr: -0.022825677 hartree
energy: -1079.755629314414
dipole: 27.65022 -27.75402 -0.10380 16.80924 -16.27415 0.53508 -5.00908 4.52770 -0.48138
magnitude: 0.72719 au
magnitude: 1.84838 debye
