program: Orca
programVersion: 5.0.2
elementType: O O O C C C C C C C C C C C C C C C C C C C C C C H H H H H H H H H H H H H H H H H H H H H H H H H H
charge: 0
multiplicity: 1
keywords: wb97x-d3
keywords: def2-TZVPP
keywords: def2/J RIJCOSX
keywords: DEFGRID2
keywords: scfconv7
keywords: smallprint printgap noloewdin
keywords: NOSOSCF
formula: C22H26O3
InChI: InChI=1/C22H26O3/c1-15(2)10-19-20(22(19,3)4)21(23)25-14-17-12-18(24-13-17)11-16-8-6-5-7-9-16/h5-10,12-13,19-20H,11,14H2,1-4H3
51 atoms
O  1.839075 -2.276037 -0.792472
O  1.999857 -1.397885 1.258506
O  -2.24757 -2.21901 1.032819
C  4.256184 0.356784 0.040824
C  2.976457 1.117183 -0.083397
C  3.058193 -0.316279 -0.597318
C  5.404396 0.660634 -0.894328
C  4.727209 -0.036133 1.420792
C  2.787849 2.23697 -1.025982
C  2.260296 -1.357257 0.08452
C  1.72319 3.039535 -1.094282
C  1.672849 4.1718 -2.075849
C  0.501358 2.901318 -0.23862
C  0.984615 -3.304918 -0.29055
C  -0.389781 -2.805843 -0.025541
C  -1.318062 -2.266883 -0.972519
C  -1.015771 -2.73675 1.170998
C  -2.425888 -1.926311 -0.272628
C  -3.707833 -1.284849 -0.659506
C  -3.934268 0.041342 0.028789
C  -5.115104 0.293303 0.713851
C  -2.962332 1.036893 -0.017796
C  -5.328614 1.514789 1.33764
C  -3.171612 2.256661 0.603421
C  -4.356742 2.500452 1.284059
H  2.42718 1.195893 0.849006
H  3.110536 -0.427697 -1.67421
H  5.087132 0.84811 -1.919737
H  6.097711 -0.181491 -0.921723
H  5.960243 1.535631 -0.552052
H  5.30944 -0.958996 1.386246
H  3.91114 -0.183448 2.122067
H  5.375666 0.747273 1.81764
H  3.599202 2.428129 -1.721399
H  1.550943 5.129873 -1.563903
H  2.576359 4.231643 -2.681492
H  0.820308 4.070431 -2.75229
H  0.342022 3.801414 0.362004
H  -0.385938 2.78932 -0.869019
H  0.530019 2.047967 0.435976
H  1.409787 -3.757669 0.60759
H  0.980259 -4.059821 -1.077239
H  -1.169639 -2.143303 -2.03364
H  -0.703874 -2.997468 2.169178
H  -4.547506 -1.953561 -0.447291
H  -3.695764 -1.147392 -1.743919
H  -5.87659 -0.475913 0.766546
H  -2.027489 0.849035 -0.533749
H  -6.253792 1.691719 1.870394
H  -2.404288 3.01916 0.561891
H  -4.517925 3.452297 1.772784
totalener: -1079.73126271 hartree
nucrepener: 2142.87442854 hartree
electener: -3222.60569125 hartree
oneelecener: -5724.09765561 hartree
twoeener: 2501.49196436 hartree
kineticenergy: 1074.91512963 hartree
xcener: -106.468652484204 hartree
chargesum: -0.0000000
charge: -0.269352 -0.395955 -0.246388 0.113521 -0.028630 -0.061989 -0.279285 -0.251613 -0.171574 0.351726 -0.018381 -0.213930 -0.285582 0.068215 -0.048064 -0.312258 0.006843 0.215074 -0.109904 0.033865 -0.137961 -0.140890 -0.120602 -0.109622 -0.142966 0.097521 0.075479 0.072333 0.092013 0.099217 0.082599 0.101664 0.082535 0.082035 0.084533 0.077043 0.084740 0.095150 0.079971 0.100438 0.101033 0.105359 0.126770 0.136722 0.090562 0.102810 0.103517 0.120437 0.122569 0.115731 0.122921
qa: -0.2694 -0.3960 -0.2464 0.1135 -0.0286 -0.0620 -0.2793 -0.2516 -0.1716 0.3517 -0.0184 -0.2139 -0.2856 0.0682 -0.0481 -0.3123 0.0068 0.2151 -0.1099 0.0339 -0.1380 -0.1409 -0.1206 -0.1096 -0.1430 0.0975 0.0755 0.0723 0.0920 0.0992 0.0826 0.1017 0.0825 0.0820 0.0845 0.0770 0.0847 0.0952 0.0800 0.1004 0.1010 0.1054 0.1268 0.1367 0.0906 0.1028 0.1035 0.1204 0.1226 0.1157 0.1229
va: 2.1250 2.1060 2.3168 3.7825 3.8412 3.8317 3.9209 3.8961 3.9164 4.2018 3.7896 3.9389 3.9525 3.8978 3.6574 4.0274 3.9895 3.6226 3.8856 3.7753 3.9808 4.0078 3.9660 3.9444 4.0105 1.0222 1.0359 1.0073 1.0047 1.0003 1.0030 1.0247 1.0008 1.0153 0.9974 1.0116 0.9988 0.9958 0.9944 1.0074 1.0099 0.9882 1.0192 1.0116 1.0095 1.0029 1.0111 0.9995 1.0006 1.0057 1.0018
dispcorr: -0.023935953 hartree
energy: -1079.755198661860
dipole: 16.25963 -16.23332 0.02631 18.35614 -18.24130 0.11484 -5.34705 4.67257 -0.67449
magnitude: 0.68470 au
magnitude: 1.74037 debye
