program: Orca
programVersion: 5.0.2
elementType: O O O C C C C C C C C C C C C C C C C C C C C C C H H H H H H H H H H H H H H H H H H H H H H H H H H
charge: 0
multiplicity: 1
keywords: wb97x-d3
keywords: def2-TZVPP
keywords: def2/J RIJCOSX
keywords: DEFGRID2
keywords: scfconv7
keywords: smallprint printgap noloewdin
keywords: NOSOSCF
formula: C22H26O3
InChI: InChI=1/C22H26O3/c1-15(2)10-19-20(22(19,3)4)21(23)25-14-17-12-18(24-13-17)11-16-8-6-5-7-9-16/h5-10,12-13,19-20H,11,14H2,1-4H3
51 atoms
O  1.196805 -1.596444 -1.216062
O  0.863175 0.568286 -1.670601
O  -2.401625 -1.989836 1.388504
C  3.497378 0.838478 0.035197
C  3.78055 1.034763 -1.422114
C  3.023772 -0.189905 -0.980489
C  4.619161 0.387248 0.939075
C  2.512788 1.756395 0.716083
C  5.1409 0.894536 -2.004395
C  1.592008 -0.327553 -1.328007
C  6.099512 1.818154 -1.923593
C  7.43952 1.616571 -2.563623
C  5.92411 3.120106 -1.202739
C  -0.172812 -1.893812 -1.507553
C  -1.07639 -1.62895 -0.356005
C  -1.574862 -0.373984 0.121774
C  -1.617537 -2.563376 0.460839
C  -2.370837 -0.655861 1.178925
C  -3.204036 0.195177 2.067534
C  -4.683232 -0.021725 1.853492
C  -5.44181 -0.73998 2.768089
C  -5.305701 0.480414 0.714874
C  -6.797301 -0.949757 2.555216
C  -6.658494 0.275796 0.499845
C  -7.409735 -0.441151 1.421108
H  3.149034 1.780035 -1.900103
H  3.572998 -1.125413 -0.963306
H  4.221681 -0.125431 1.816492
H  5.197534 1.244819 1.2892
H  5.311584 -0.28772 0.43828
H  1.743276 2.125645 0.043215
H  3.04135 2.620821 1.123159
H  2.018169 1.253111 1.548918
H  5.348398 -0.019983 -2.552703
H  8.240607 1.667887 -1.822297
H  7.512077 0.654956 -3.069828
H  7.646146 2.398337 -3.298415
H  6.668169 3.227304 -0.409681
H  6.074638 3.962135 -1.882403
H  4.938918 3.226555 -0.753329
H  -0.178869 -2.956192 -1.751187
H  -0.497348 -1.343249 -2.392186
H  -1.361291 0.601872 -0.280307
H  -1.535936 -3.638245 0.490891
H  -2.944953 1.236873 1.868246
H  -2.949378 0.009707 3.114838
H  -4.969385 -1.14075 3.656818
H  -4.722336 1.032344 -0.012923
H  -7.374459 -1.511675 3.277888
H  -7.12858 0.676285 -0.388836
H  -8.466706 -0.601511 1.254253
totalener: -1079.73271548 hartree
nucrepener: 2044.04269494 hartree
electener: -3123.77541042 hartree
oneelecener: -5526.47885631 hartree
twoeener: 2402.70344589 hartree
kineticenergy: 1074.91582486 hartree
xcener: -106.466777809111 hartree
chargesum: 0.0000000
charge: -0.259312 -0.407155 -0.251279 0.076162 -0.031047 -0.091949 -0.247562 -0.270008 -0.190572 0.369385 -0.022862 -0.211885 -0.244004 0.050239 -0.061624 -0.275041 -0.035121 0.230334 -0.132798 0.076721 -0.147574 -0.162409 -0.124128 -0.126237 -0.131708 0.109014 0.080509 0.097793 0.083861 0.083100 0.099842 0.081278 0.091744 0.089493 0.084069 0.079288 0.086251 0.087454 0.097623 0.083707 0.093991 0.114101 0.150753 0.134447 0.110093 0.097239 0.104506 0.111589 0.122401 0.123564 0.123724
qa: -0.2593 -0.4072 -0.2513 0.0762 -0.0310 -0.0919 -0.2476 -0.2700 -0.1906 0.3694 -0.0229 -0.2119 -0.2440 0.0502 -0.0616 -0.2750 -0.0351 0.2303 -0.1328 0.0767 -0.1476 -0.1624 -0.1241 -0.1262 -0.1317 0.1090 0.0805 0.0978 0.0839 0.0831 0.0998 0.0813 0.0917 0.0895 0.0841 0.0793 0.0863 0.0875 0.0976 0.0837 0.0940 0.1141 0.1508 0.1344 0.1101 0.0972 0.1045 0.1116 0.1224 0.1236 0.1237
va: 2.1357 2.0944 2.3142 3.7311 3.8126 3.8619 3.9046 3.9071 3.8579 4.2174 3.7383 3.9388 3.9356 3.9083 3.7187 4.0162 4.0016 3.6037 3.8805 3.6299 4.0072 3.9988 3.9591 3.9677 3.9595 1.0262 1.0338 1.0057 1.0021 1.0073 1.0211 1.0034 1.0031 1.0132 0.9988 1.0105 0.9982 0.9988 1.0038 1.0107 0.9980 1.0046 1.0225 1.0071 1.0073 1.0099 1.0125 1.0115 1.0008 1.0005 1.0001
dispcorr: -0.023023024 hartree
energy: -1079.755738506583
dipole: 30.88968 -30.37547 0.51421 14.11318 -14.24246 -0.12928 -1.40969 1.64606 0.23637
magnitude: 0.58051 au
magnitude: 1.47555 debye
