program: Orca
programVersion: 5.0.2
elementType: O O O C C C C C C C C C C C C C C C C C C C C C C H H H H H H H H H H H H H H H H H H H H H H H H H H
charge: 0
multiplicity: 1
keywords: wb97x-d3
keywords: def2-TZVPP
keywords: def2/J RIJCOSX
keywords: DEFGRID2
keywords: scfconv7
keywords: smallprint printgap noloewdin
keywords: NOSOSCF
formula: C22H26O3
InChI: InChI=1/C22H26O3/c1-15(2)10-19-20(22(19,3)4)21(23)25-14-17-12-18(24-13-17)11-16-8-6-5-7-9-16/h5-10,12-13,19-20H,11,14H2,1-4H3
51 atoms
O  1.21061 -0.110101 1.026982
O  2.211181 -1.628698 -0.276293
O  -2.082032 -2.665465 -0.407357
C  2.649239 0.896963 -2.103964
C  3.91577 0.524053 -1.411534
C  2.650618 0.700404 -0.596335
C  2.45911 2.322111 -2.567031
C  1.986228 -0.112205 -3.00928
C  5.048479 1.472772 -1.259398
C  2.022456 -0.479249 0.034461
C  5.938985 1.449462 -0.266704
C  7.071072 2.42925 -0.205327
C  5.88945 0.460232 0.856811
C  0.496994 -1.150249 1.703306
C  -0.718044 -1.570832 0.955223
C  -2.014315 -0.96626 1.006091
C  -0.827916 -2.593243 0.074922
C  -2.800993 -1.673537 0.162512
C  -4.234557 -1.561061 -0.224656
C  -4.908701 -0.437646 0.513666
C  -4.833293 0.866327 0.036346
C  -5.582913 -0.674798 1.705838
C  -5.421194 1.911065 0.73283
C  -6.174906 0.366808 2.404851
C  -6.095215 1.663391 1.919771
H  4.199588 -0.518179 -1.535495
H  2.573408 1.613794 -0.017685
H  2.907098 2.47119 -3.551916
H  2.904489 3.048066 -1.886838
H  1.396786 2.556749 -2.650229
H  2.160181 -1.138616 -2.69673
H  2.373746 -0.002945 -4.024086
H  0.907102 0.047989 -3.049092
H  5.168384 2.220561 -2.038231
H  8.036155 1.916506 -0.209537
H  7.058152 3.124879 -1.04356
H  7.034031 3.013601 0.717569
H  6.815386 -0.118579 0.901715
H  5.798518 0.971803 1.818462
H  5.062702 -0.241862 0.772332
H  0.219551 -0.715679 2.663061
H  1.154002 -1.999771 1.893628
H  -2.316172 -0.119069 1.600411
H  -0.117372 -3.31338 -0.295622
H  -4.748388 -2.505437 -0.020335
H  -4.315788 -1.402331 -1.304838
H  -4.305507 1.065842 -0.888748
H  -5.643455 -1.685053 2.09271
H  -5.354523 2.919928 0.347177
H  -6.699328 0.16441 3.329543
H  -6.557131 2.477168 2.463029
totalener: -1079.73308721 hartree
nucrepener: 2066.63889597 hartree
electener: -3146.37198318 hartree
oneelecener: -5571.65105051 hartree
twoeener: 2425.27906734 hartree
kineticenergy: 1074.91002046 hartree
xcener: -106.466967619849 hartree
chargesum: 0.0000000
charge: -0.261533 -0.407033 -0.255168 0.131171 -0.035440 -0.096435 -0.279340 -0.257194 -0.228194 0.352578 -0.004337 -0.210479 -0.228631 0.061769 -0.094065 -0.237652 0.003858 0.160646 -0.051296 0.021010 -0.160721 -0.151321 -0.122202 -0.124324 -0.127337 0.103927 0.081336 0.090882 0.082830 0.091291 0.099284 0.083474 0.087028 0.093207 0.085809 0.078131 0.084076 0.089033 0.084966 0.080710 0.101306 0.112298 0.137996 0.150598 0.090672 0.094728 0.112296 0.109724 0.125346 0.125137 0.125589
qa: -0.2615 -0.4070 -0.2552 0.1312 -0.0354 -0.0964 -0.2793 -0.2572 -0.2282 0.3526 -0.0043 -0.2105 -0.2286 0.0618 -0.0941 -0.2377 0.0039 0.1606 -0.0513 0.0210 -0.1607 -0.1513 -0.1222 -0.1243 -0.1273 0.1039 0.0813 0.0909 0.0828 0.0913 0.0993 0.0835 0.0870 0.0932 0.0858 0.0781 0.0841 0.0890 0.0850 0.0807 0.1013 0.1123 0.1380 0.1506 0.0907 0.0947 0.1123 0.1097 0.1253 0.1251 0.1256
va: 2.1321 2.0890 2.3056 3.7498 3.8384 3.8272 3.9122 3.8976 3.8932 4.1950 3.7314 3.9411 3.9448 3.8663 3.6984 4.0112 3.9657 3.7088 3.8624 3.6702 3.9781 3.9859 3.9563 3.9619 3.9538 1.0265 1.0338 1.0004 1.0048 1.0064 1.0218 1.0025 1.0017 1.0088 0.9986 1.0100 0.9989 1.0013 1.0007 1.0193 0.9943 1.0106 1.0079 1.0142 1.0093 1.0055 1.0107 1.0112 1.0003 1.0004 0.9997
dispcorr: -0.022739372 hartree
energy: -1079.755826582806
dipole: 23.74400 -23.93536 -0.19136 13.67624 -12.99701 0.67924 -6.51567 6.80223 0.28656
magnitude: 0.76164 au
magnitude: 1.93594 debye
