program: Orca
programVersion: 5.0.2
elementType: O O O C C C C C C C C C C C C C C C C C C C C C C H H H H H H H H H H H H H H H H H H H H H H H H H H
charge: 0
multiplicity: 1
keywords: wb97x-d3
keywords: def2-TZVPP
keywords: def2/J RIJCOSX
keywords: DEFGRID2
keywords: scfconv7
keywords: smallprint printgap noloewdin
keywords: NOSOSCF
formula: C22H26O3
InChI: InChI=1/C22H26O3/c1-15(2)10-19-20(22(19,3)4)21(23)25-14-17-12-18(24-13-17)11-16-8-6-5-7-9-16/h5-10,12-13,19-20H,11,14H2,1-4H3
51 atoms
O  1.76233 -2.326113 -0.118346
O  0.972048 -1.361256 -1.978321
O  -2.099243 -3.063607 1.689252
C  1.551463 1.190617 -0.22507
C  2.544091 1.087255 -1.344685
C  2.320695 -0.103844 -0.455733
C  1.928643 1.958599 1.017884
C  0.081038 1.282175 -0.553845
C  3.857145 1.783977 -1.31422
C  1.615854 -1.300368 -0.962559
C  4.039462 3.080256 -1.568754
C  5.403237 3.701337 -1.539057
C  2.918663 4.01462 -1.908327
C  0.929089 -3.473129 -0.31829
C  -0.428657 -3.221885 0.237024
C  -1.498781 -2.484368 -0.360613
C  -0.861045 -3.544006 1.479244
C  -2.479139 -2.409923 0.568141
C  -3.769397 -1.667579 0.604754
C  -3.55275 -0.206015 0.925068
C  -3.12318 0.185439 2.190223
C  -3.73467 0.76846 -0.048284
C  -2.881993 1.520323 2.472535
C  -3.496367 2.106765 0.231929
C  -3.068144 2.486904 1.493361
H  2.09502 0.98599 -2.329906
H  3.083219 -0.311974 0.287849
H  1.350339 1.603983 1.8728
H  1.713535 3.021629 0.88994
H  2.986397 1.868208 1.261633
H  -0.206754 2.331394 -0.649202
H  -0.533424 0.851476 0.239459
H  -0.176855 0.783215 -1.484653
H  4.728233 1.177312 -1.082651
H  6.177759 2.979029 -1.284131
H  5.657955 4.138035 -2.508016
H  5.44833 4.514885 -0.810624
H  1.945328 3.527804 -1.901535
H  2.882822 4.849218 -1.203517
H  3.06735 4.453305 -2.898323
H  1.425103 -4.27923 0.221335
H  0.889089 -3.743609 -1.374085
H  -1.511085 -2.044597 -1.343609
H  -0.409264 -4.095814 2.287948
H  -4.437657 -2.123245 1.339436
H  -4.263381 -1.761266 -0.363865
H  -2.970804 -0.561592 2.960087
H  -4.063205 0.479489 -1.039605
H  -2.548367 1.808229 3.461042
H  -3.643944 2.851465 -0.539273
H  -2.88138 3.529418 1.714616
totalener: -1079.73021821 hartree
nucrepener: 2183.50250027 hartree
electener: -3263.23271848 hartree
oneelecener: -5805.51036702 hartree
twoeener: 2542.27764854 hartree
kineticenergy: 1074.90653306 hartree
xcener: -106.465557972299 hartree
chargesum: -0.0000000
charge: -0.260814 -0.396154 -0.254723 0.116955 -0.024792 -0.099340 -0.252232 -0.277413 -0.192230 0.357938 -0.023665 -0.211176 -0.241979 0.051212 -0.044709 -0.306056 -0.036757 0.261126 -0.115507 0.029526 -0.141707 -0.136814 -0.129403 -0.136389 -0.126937 0.107856 0.077914 0.097313 0.081950 0.083028 0.079354 0.081079 0.098434 0.088080 0.079019 0.085939 0.083281 0.083505 0.085997 0.097170 0.095425 0.114280 0.146519 0.134340 0.109202 0.095500 0.113624 0.103493 0.123374 0.123135 0.123230
qa: -0.2608 -0.3962 -0.2547 0.1170 -0.0248 -0.0993 -0.2522 -0.2774 -0.1922 0.3579 -0.0237 -0.2112 -0.2420 0.0512 -0.0447 -0.3061 -0.0368 0.2611 -0.1155 0.0295 -0.1417 -0.1368 -0.1294 -0.1364 -0.1269 0.1079 0.0779 0.0973 0.0820 0.0830 0.0794 0.0811 0.0984 0.0881 0.0790 0.0859 0.0833 0.0835 0.0860 0.0972 0.0954 0.1143 0.1465 0.1343 0.1092 0.0955 0.1136 0.1035 0.1234 0.1231 0.1232
va: 2.1278 2.1084 2.3025 3.7101 3.8188 3.8649 3.9027 3.9061 3.8621 4.2489 3.7355 3.9387 3.9344 3.9063 3.7238 3.9839 3.9885 3.5488 3.8516 3.7028 3.9633 3.9422 3.9495 3.9403 3.9239 1.0253 1.0352 1.0063 1.0022 1.0080 1.0060 1.0018 1.0229 1.0133 1.0105 0.9981 0.9989 1.0113 0.9992 1.0034 0.9965 1.0071 1.0234 1.0072 1.0132 1.0113 1.0195 1.0121 1.0011 1.0018 1.0005
dispcorr: -0.027037757 hartree
energy: -1079.757255969157
dipole: 14.43113 -14.38032 0.05081 25.06100 -24.68713 0.37388 -3.77487 4.27466 0.49980
magnitude: 0.62623 au
magnitude: 1.59174 debye
