program: Orca
programVersion: 5.0.2
elementType: O O O C C C C C C C C C C C C C C C C C C C C C C H H H H H H H H H H H H H H H H H H H H H H H H H H
charge: 0
multiplicity: 1
keywords: wb97x-d3
keywords: def2-TZVPP
keywords: def2/J RIJCOSX
keywords: DEFGRID2
keywords: scfconv7
keywords: smallprint printgap noloewdin
keywords: NOSOSCF
formula: C22H26O3
InChI: InChI=1/C22H26O3/c1-15(2)10-19-20(22(19,3)4)21(23)25-14-17-12-18(24-13-17)11-16-8-6-5-7-9-16/h5-10,12-13,19-20H,11,14H2,1-4H3
51 atoms
O  1.733913 -2.032157 -0.017468
O  1.145599 -1.21579 -2.017294
O  -2.593521 -2.350267 -0.362536
C  1.136369 1.40153 -0.225211
C  2.209499 1.443885 -1.263297
C  2.100727 0.231665 -0.373006
C  1.295595 2.219223 1.033724
C  -0.303864 1.266091 -0.659724
C  3.383308 2.348778 -1.156529
C  1.615037 -1.050214 -0.921766
C  4.605061 2.074445 -1.616003
C  5.728161 3.058392 -1.487923
C  4.957367 0.786048 -2.29471
C  0.960542 -3.210826 -0.258651
C  -0.476251 -2.910784 -0.020177
C  -1.075569 -2.558487 1.230559
C  -1.451213 -2.756999 -0.944786
C  -2.357102 -2.220694 0.960954
C  -3.441965 -1.638165 1.795072
C  -3.45957 -0.131564 1.676001
C  -2.789665 0.657507 2.604195
C  -4.091236 0.488612 0.603316
C  -2.752143 2.037155 2.467725
C  -4.054092 1.867489 0.462628
C  -3.383724 2.646479 1.394023
H  1.854644 1.267267 -2.276008
H  2.829324 0.138685 0.424918
H  2.330824 2.27641 1.370641
H  0.703234 1.787383 1.842207
H  0.939602 3.239792 0.876447
H  -0.902607 0.767496 0.105588
H  -0.414859 0.711626 -1.588508
H  -0.735699 2.256941 -0.811884
H  3.214925 3.316698 -0.69278
H  6.119376 3.339551 -2.4689
H  5.418863 3.969549 -0.977085
H  6.56514 2.628348 -0.931866
H  5.336451 0.973995 -3.302419
H  5.756142 0.269154 -1.75652
H  4.113731 0.104731 -2.380188
H  1.339192 -3.943749 0.453251
H  1.127033 -3.596123 -1.26583
H  -0.597616 -2.535388 2.196936
H  -1.463118 -2.877426 -2.015363
H  -3.275876 -1.929727 2.833309
H  -4.409469 -2.054874 1.504007
H  -2.290505 0.188507 3.444233
H  -4.611851 -0.112167 -0.132404
H  -2.229628 2.636352 3.202114
H  -4.549454 2.334671 -0.378481
H  -3.355771 3.722507 1.284494
totalener: -1079.72967679 hartree
nucrepener: 2201.89347004 hartree
electener: -3281.62314683 hartree
oneelecener: -5842.34722813 hartree
twoeener: 2560.72408130 hartree
kineticenergy: 1074.91679291 hartree
xcener: -106.467745633084 hartree
chargesum: -0.0000000
charge: -0.265606 -0.382901 -0.252377 0.182814 -0.026223 -0.102379 -0.290949 -0.241029 -0.242847 0.321431 -0.004455 -0.212112 -0.225674 0.066598 -0.063989 -0.283413 0.004612 0.221987 -0.136371 0.073523 -0.148822 -0.146514 -0.139149 -0.121587 -0.133648 0.106104 0.080647 0.086989 0.086002 0.089539 0.055898 0.099028 0.085761 0.091979 0.086263 0.077850 0.083301 0.088725 0.083500 0.082706 0.103212 0.105427 0.121647 0.142077 0.097188 0.109044 0.102065 0.111483 0.124637 0.123490 0.124519
qa: -0.2656 -0.3829 -0.2524 0.1828 -0.0262 -0.1024 -0.2909 -0.2410 -0.2428 0.3214 -0.0045 -0.2121 -0.2257 0.0666 -0.0640 -0.2834 0.0046 0.2220 -0.1364 0.0735 -0.1488 -0.1465 -0.1391 -0.1216 -0.1336 0.1061 0.0806 0.0870 0.0860 0.0895 0.0559 0.0990 0.0858 0.0920 0.0863 0.0779 0.0833 0.0887 0.0835 0.0827 0.1032 0.1054 0.1216 0.1421 0.0972 0.1090 0.1021 0.1115 0.1246 0.1235 0.1245
va: 2.1117 2.1151 2.3005 3.7004 3.8401 3.8206 3.9099 3.9002 3.9030 4.2437 3.7313 3.9418 3.9410 3.8980 3.7063 4.0273 3.9701 3.6066 3.8771 3.6243 3.9474 3.9859 3.9367 3.9466 3.9276 1.0257 1.0330 1.0070 1.0092 1.0008 1.0046 1.0251 1.0055 1.0095 0.9984 1.0097 0.9992 1.0016 1.0011 1.0206 0.9913 1.0104 1.0206 1.0117 1.0133 1.0122 1.0126 1.0178 1.0006 1.0007 1.0003
dispcorr: -0.027633514 hartree
energy: -1079.757310302515
dipole: 17.38006 -17.33518 0.04489 17.47661 -17.34052 0.13609 -1.11965 1.84275 0.72310
magnitude: 0.73716 au
magnitude: 1.87372 debye
