program: Orca
programVersion: 5.0.2
elementType: O O O C C C C C C C C C C C C C C C C C C C C C C H H H H H H H H H H H H H H H H H H H H H H H H H H
charge: 0
multiplicity: 1
keywords: wb97x-d3
keywords: def2-TZVPP
keywords: def2/J RIJCOSX
keywords: DEFGRID2
keywords: scfconv7
keywords: smallprint printgap noloewdin
keywords: NOSOSCF
formula: C22H26O3
InChI: InChI=1/C22H26O3/c1-15(2)10-19-20(22(19,3)4)21(23)25-14-17-12-18(24-13-17)11-16-8-6-5-7-9-16/h5-10,12-13,19-20H,11,14H2,1-4H3
51 atoms
O  1.765131 -2.011226 -0.113229
O  1.132825 -1.177295 -2.092932
O  -2.563388 -2.387767 -0.355844
C  1.072523 1.399382 -0.242054
C  2.126192 1.503169 -1.295896
C  2.071949 0.266115 -0.435299
C  1.224195 2.187353 1.036436
C  -0.368509 1.228488 -0.66089
C  3.270426 2.444297 -1.183514
C  1.614197 -1.018521 -1.001876
C  4.487452 2.232503 -1.686441
C  5.578469 3.250715 -1.54908
C  4.863756 0.984817 -2.425801
C  1.004036 -3.19793 -0.353595
C  -0.429853 -2.920165 -0.07381
C  -0.995469 -2.566031 1.192046
C  -1.433852 -2.784536 -0.96941
C  -2.288693 -2.245826 0.959044
C  -3.355197 -1.673891 1.823774
C  -3.410505 -0.169253 1.690609
C  -2.714364 0.64373 2.578181
C  -4.106685 0.426648 0.644576
C  -2.716903 2.022604 2.430065
C  -4.109776 1.804901 0.492134
C  -3.414233 2.607698 1.383916
H  1.759704 1.3420 -2.306978
H  2.817623 0.178472 0.347302
H  0.829871 3.198663 0.914921
H  2.262271 2.271241 1.358729
H  0.661189 1.711575 1.841203
H  -0.937046 0.680825 0.093455
H  -0.473709 0.705212 -1.608345
H  -0.837314 2.208152 -0.769638
H  3.081662 3.386319 -0.676328
H  5.928139 3.588123 -2.527994
H  5.253216 4.127052 -0.989577
H  6.447483 2.828601 -1.03804
H  4.046118 0.271369 -2.501484
H  5.191602 1.224215 -3.440612
H  5.705367 0.484003 -1.940313
H  1.412165 -3.936434 0.335958
H  1.149425 -3.564361 -1.371021
H  -0.489289 -2.531675 2.143534
H  -1.476167 -2.91341 -2.038316
H  -3.145831 -1.949473 2.858551
H  -4.323926 -2.113337 1.57297
H  -2.16286 0.1942 3.395834
H  -4.647974 -0.192336 -0.06047
H  -2.17296 2.640293 3.132891
H  -4.657066 2.253063 -0.326817
H  -3.419197 3.683294 1.266434
totalener: -1079.72951003 hartree
nucrepener: 2205.53931826 hartree
electener: -3285.26882829 hartree
oneelecener: -5849.63146534 hartree
twoeener: 2564.36263704 hartree
kineticenergy: 1074.91582520 hartree
xcener: -106.467847057634 hartree
chargesum: -0.0000000
charge: -0.265950 -0.381026 -0.251808 0.190968 -0.029794 -0.103316 -0.294194 -0.240734 -0.241905 0.320291 -0.004235 -0.212165 -0.226171 0.066062 -0.062991 -0.282487 0.005245 0.219518 -0.137484 0.072979 -0.151859 -0.142886 -0.138212 -0.120716 -0.135224 0.105924 0.080171 0.089847 0.087665 0.085465 0.052497 0.099915 0.086728 0.092028 0.086170 0.077905 0.083166 0.083018 0.088864 0.082941 0.103570 0.104953 0.121474 0.141167 0.097621 0.109329 0.102724 0.111158 0.124799 0.124213 0.124783
qa: -0.2660 -0.3810 -0.2518 0.1910 -0.0298 -0.1033 -0.2942 -0.2407 -0.2419 0.3203 -0.0042 -0.2122 -0.2262 0.0661 -0.0630 -0.2825 0.0052 0.2195 -0.1375 0.0730 -0.1519 -0.1429 -0.1382 -0.1207 -0.1352 0.1059 0.0802 0.0898 0.0877 0.0855 0.0525 0.0999 0.0867 0.0920 0.0862 0.0779 0.0832 0.0830 0.0889 0.0829 0.1036 0.1050 0.1215 0.1412 0.0976 0.1093 0.1027 0.1112 0.1248 0.1242 0.1248
va: 2.1098 2.1173 2.3002 3.6877 3.8441 3.8221 3.9104 3.8985 3.9026 4.2490 3.7298 3.9415 3.9409 3.9008 3.7085 4.0229 3.9700 3.6063 3.8757 3.6185 3.9405 3.9869 3.9304 3.9487 3.9259 1.0253 1.0333 1.0006 1.0073 1.0093 1.0042 1.0257 1.0054 1.0093 0.9982 1.0097 0.9992 1.0205 1.0013 1.0011 0.9912 1.0106 1.0207 1.0114 1.0131 1.0119 1.0126 1.0175 1.0003 1.0003 1.0002
dispcorr: -0.027923194 hartree
energy: -1079.757433223985
dipole: 16.78588 -16.74880 0.03708 17.89983 -17.76646 0.13337 -1.13898 1.86604 0.72706
magnitude: 0.74012 au
magnitude: 1.88125 debye
