program: Orca
programVersion: 5.0.2
elementType: O O O C C C C C C C C C C C C C C C C C C C C C C H H H H H H H H H H H H H H H H H H H H H H H H H H
charge: 0
multiplicity: 1
keywords: wb97x-d3
keywords: def2-TZVPP
keywords: def2/J RIJCOSX
keywords: DEFGRID2
keywords: scfconv7
keywords: smallprint printgap noloewdin
keywords: NOSOSCF
formula: C22H26O3
InChI: InChI=1/C22H26O3/c1-15(2)10-19-20(22(19,3)4)21(23)25-14-17-12-18(24-13-17)11-16-8-6-5-7-9-16/h5-10,12-13,19-20H,11,14H2,1-4H3
51 atoms
O  1.137822 -0.97424 -1.530824
O  1.010091 1.242271 -1.239738
O  -2.39338 -1.967837 0.983022
C  3.645159 0.664963 0.396585
C  3.952595 1.348475 -0.89305
C  3.086974 0.107623 -0.903636
C  4.713982 -0.177774 1.050148
C  2.735277 1.348228 1.388339
C  5.311014 1.330042 -1.494278
C  1.650026 0.220669 -1.231726
C  5.574395 1.282285 -2.800925
C  6.981476 1.300102 -3.316418
C  4.510274 1.212191 -3.85273
C  -0.258969 -1.043419 -1.837982
C  -1.10291 -1.129027 -0.616563
C  -1.462394 -0.082736 0.292913
C  -1.702214 -2.243557 -0.135417
C  -2.243097 -0.651067 1.240627
C  -2.948621 -0.101464 2.426788
C  -4.450947 -0.168224 2.291072
C  -5.115063 0.703754 1.434034
C  -5.192312 -1.106107 2.997079
C  -6.49156 0.644942 1.292781
C  -6.571768 -1.169848 2.857217
C  -7.225286 -0.293306 2.005917
H  3.388883 2.264249 -1.055263
H  3.556525 -0.808606 -1.243236
H  4.26285 -0.936847 1.691324
H  5.363152 0.438645 1.675612
H  5.343875 -0.690652 0.323408
H  3.328979 1.963443 2.067165
H  2.194591 0.617187 1.9925
H  2.003713 1.995415 0.910842
H  6.147785 1.395862 -0.804322
H  7.712989 1.344242 -2.510529
H  7.191922 0.409506 -3.913955
H  7.149564 2.159565 -3.970045
H  4.606588 0.296219 -4.441515
H  3.503193 1.244329 -3.443403
H  4.609776 2.042674 -4.555973
H  -0.368473 -1.948379 -2.434919
H  -0.552222 -0.193123 -2.455556
H  -1.169347 0.952078 0.235696
H  -1.72225 -3.265699 -0.47871
H  -2.628689 0.935054 2.550472
H  -2.635014 -0.630569 3.331354
H  -4.546297 1.43313 0.869025
H  -4.687603 -1.794954 3.663759
H  -6.993913 1.33326 0.625669
H  -7.135461 -1.906222 3.414973
H  -8.30083 -0.339451 1.897517
totalener: -1079.73254709 hartree
nucrepener: 2055.61683661 hartree
electener: -3135.34938370 hartree
oneelecener: -5549.61987500 hartree
twoeener: 2414.27049130 hartree
kineticenergy: 1074.91277634 hartree
xcener: -106.466316630673 hartree
chargesum: 0.0000000
charge: -0.256650 -0.405994 -0.250515 0.134918 -0.024879 -0.112766 -0.276837 -0.264393 -0.236420 0.360852 -0.005936 -0.211392 -0.225385 0.048259 -0.060070 -0.277894 -0.035005 0.227625 -0.130468 0.077137 -0.163488 -0.146365 -0.125866 -0.125990 -0.131295 0.105985 0.085762 0.092791 0.088738 0.085106 0.084871 0.089003 0.096796 0.092700 0.078540 0.084150 0.086840 0.085811 0.082429 0.089528 0.094124 0.114095 0.150899 0.134658 0.110624 0.097555 0.111951 0.104983 0.124205 0.122611 0.124058
qa: -0.2566 -0.4060 -0.2505 0.1349 -0.0249 -0.1128 -0.2768 -0.2644 -0.2364 0.3609 -0.0059 -0.2114 -0.2254 0.0483 -0.0601 -0.2779 -0.0350 0.2276 -0.1305 0.0771 -0.1635 -0.1464 -0.1259 -0.1260 -0.1313 0.1060 0.0858 0.0928 0.0887 0.0851 0.0849 0.0890 0.0968 0.0927 0.0785 0.0842 0.0868 0.0858 0.0824 0.0895 0.0941 0.1141 0.1509 0.1347 0.1106 0.0976 0.1120 0.1050 0.1242 0.1226 0.1241
va: 2.1302 2.0912 2.3155 3.7366 3.8232 3.8357 3.9083 3.9015 3.8960 4.1789 3.7353 3.9416 3.9418 3.9053 3.7208 4.0122 4.0018 3.6078 3.8779 3.6286 3.9995 4.0067 3.9664 3.9614 3.9586 1.0261 1.0316 1.0059 1.0013 1.0051 1.0035 1.0020 1.0200 1.0096 1.0098 0.9991 0.9986 1.0009 1.0185 1.0021 0.9980 1.0056 1.0217 1.0071 1.0069 1.0087 1.0113 1.0123 1.0004 1.0008 1.0001
dispcorr: -0.022827085 hartree
energy: -1079.755374175734
dipole: 28.17490 -27.80707 0.36783 7.39854 -7.77806 -0.37952 -5.45098 5.39394 -0.05704
magnitude: 0.53159 au
magnitude: 1.35118 debye
