program: Orca
programVersion: 5.0.2
elementType: O O O C C C C C C C C C C C C C C C C C C C C C C H H H H H H H H H H H H H H H H H H H H H H H H H H
charge: 0
multiplicity: 1
keywords: wb97x-d3
keywords: def2-TZVPP
keywords: def2/J RIJCOSX
keywords: DEFGRID2
keywords: scfconv7
keywords: smallprint printgap noloewdin
keywords: NOSOSCF
formula: C22H26O3
InChI: InChI=1/C22H26O3/c1-15(2)10-19-20(22(19,3)4)21(23)25-14-17-12-18(24-13-17)11-16-8-6-5-7-9-16/h5-10,12-13,19-20H,11,14H2,1-4H3
51 atoms
O  1.578635 -1.823573 -0.195958
O  1.804928 -0.025294 1.11747
O  -2.882225 -1.782743 -0.348328
C  4.506064 0.244685 -0.44905
C  3.499561 1.225366 -0.96904
C  3.123551 -0.230383 -0.86605
C  5.640433 -0.168826 -1.35503
C  4.897601 0.298606 1.007385
C  3.625427 1.86506 -2.304064
C  2.113117 -0.646196 0.132011
C  4.328407 2.971695 -2.548407
C  4.38319 3.581918 -3.916048
C  5.103455 3.697721 -1.491292
C  0.579123 -2.367873 0.673082
C  -0.782449 -1.852735 0.369215
C  -1.33151 -0.560242 0.651609
C  -1.777835 -2.539927 -0.238796
C  -2.603481 -0.576367 0.191166
C  -3.690734 0.436968 0.198508
C  -4.845326 0.046314 1.08951
C  -5.984631 -0.547883 0.561817
C  -4.772927 0.254241 2.46289
C  -7.034857 -0.921902 1.387942
C  -5.820458 -0.115384 3.291164
C  -6.956435 -0.705091 2.754729
H  3.042773 1.843219 -0.200168
H  3.096478 -0.793896 -1.792694
H  6.444973 0.568476 -1.316911
H  5.333783 -0.258545 -2.396224
H  6.052737 -1.129211 -1.04087
H  5.179815 -0.690233 1.374377
H  4.10471 0.679303 1.645993
H  5.765891 0.949939 1.127724
H  3.089577 1.400041 -3.126595
H  5.41265 3.647411 -4.276951
H  3.807261 3.010784 -4.643203
H  3.991925 4.602399 -3.906273
H  4.718856 4.711697 -1.3543
H  5.075327 3.196445 -0.525705
H  6.151357 3.802362 -1.783318
H  0.843437 -2.178961 1.714696
H  0.619174 -3.4439 0.50448
H  -0.831893 0.263695 1.132846
H  -1.83646 -3.54405 -0.62778
H  -4.050362 0.607438 -0.820452
H  -3.260338 1.381935 0.53486
H  -6.052829 -0.719464 -0.505643
H  -3.885453 0.70874 2.887722
H  -7.916706 -1.382343 0.961854
H  -5.751226 0.05856 4.357059
H  -7.776555 -0.992113 3.399559
totalener: -1079.73275086 hartree
nucrepener: 2033.47520487 hartree
electener: -3113.20795573 hartree
oneelecener: -5505.37478924 hartree
twoeener: 2392.16683351 hartree
kineticenergy: 1074.90812217 hartree
xcener: -106.464938199070 hartree
chargesum: 0.0000000
charge: -0.260155 -0.413407 -0.253075 0.083617 -0.032453 -0.089798 -0.244022 -0.274019 -0.186248 0.370083 -0.028847 -0.211751 -0.236039 0.056759 -0.075741 -0.253709 -0.033992 0.217095 -0.134133 0.091235 -0.150809 -0.168831 -0.124385 -0.122769 -0.133942 0.106236 0.078731 0.086009 0.081652 0.093847 0.089430 0.105253 0.082013 0.089891 0.083670 0.079257 0.086092 0.095985 0.080774 0.085095 0.112348 0.095008 0.151168 0.133690 0.101295 0.106849 0.105856 0.109285 0.122042 0.123622 0.124239
qa: -0.2602 -0.4134 -0.2531 0.0836 -0.0325 -0.0898 -0.2440 -0.2740 -0.1862 0.3701 -0.0288 -0.2118 -0.2360 0.0568 -0.0757 -0.2537 -0.0340 0.2171 -0.1341 0.0912 -0.1508 -0.1688 -0.1244 -0.1228 -0.1339 0.1062 0.0787 0.0860 0.0817 0.0938 0.0894 0.1053 0.0820 0.0899 0.0837 0.0793 0.0861 0.0960 0.0808 0.0851 0.1123 0.0950 0.1512 0.1337 0.1013 0.1068 0.1059 0.1093 0.1220 0.1236 0.1242
va: 2.1371 2.0805 2.3146 3.7113 3.8183 3.8788 3.9094 3.9042 3.8508 4.2065 3.7367 3.9403 3.9383 3.8966 3.7461 4.0336 3.9983 3.6300 3.8813 3.6101 4.0098 4.0042 3.9585 3.9619 3.9607 1.0268 1.0349 1.0029 1.0076 1.0053 1.0028 1.0209 1.0018 1.0134 0.9991 1.0105 0.9978 1.0021 1.0115 0.9999 1.0076 0.9984 1.0215 1.0070 1.0073 1.0090 1.0135 1.0114 1.0007 1.0004 0.9999
dispcorr: -0.022420561 hartree
energy: -1079.755171423947
dipole: 29.87089 -29.48105 0.38984 15.30745 -15.33142 -0.02397 -8.71093 8.28918 -0.42175
magnitude: 0.57483 au
magnitude: 1.46110 debye
