program: Orca
programVersion: 5.0.2
elementType: O O O C C C C C C C C C C C C C C C C C C C C C C H H H H H H H H H H H H H H H H H H H H H H H H H H
charge: 0
multiplicity: 1
keywords: wb97x-d3
keywords: def2-TZVPP
keywords: def2/J RIJCOSX
keywords: DEFGRID2
keywords: scfconv7
keywords: smallprint printgap noloewdin
keywords: NOSOSCF
formula: C22H26O3
InChI: InChI=1/C22H26O3/c1-15(2)10-19-20(22(19,3)4)21(23)25-14-17-12-18(24-13-17)11-16-8-6-5-7-9-16/h5-10,12-13,19-20H,11,14H2,1-4H3
51 atoms
O  1.011591 -0.5304 -1.743606
O  1.049104 1.53245 -0.875515
O  -2.57271 -1.969781 0.470505
C  3.655375 0.409313 0.47793
C  4.005771 1.339076 -0.634788
C  3.038501 0.206357 -0.898134
C  4.658373 -0.640848 0.892519
C  2.820883 0.92088 1.626791
C  5.357757 1.341908 -1.252061
C  1.612791 0.503422 -1.151725
C  5.622203 1.447246 -2.555021
C  7.031304 1.460381 -3.06605
C  4.563971 1.566728 -3.608219
C  -0.388838 -0.420004 -2.017611
C  -1.222693 -0.797917 -0.845558
C  -1.467422 -0.05587 0.354893
C  -1.922701 -1.947926 -0.705519
C  -2.289922 -0.816754 1.113283
C  -2.938817 -0.595369 2.432177
C  -4.425558 -0.364034 2.305952
C  -5.32242 -1.421043 2.3977
C  -4.91815 0.912335 2.05767
C  -6.684818 -1.20725 2.248509
C  -6.278558 1.130421 1.908922
C  -7.167107 0.069529 2.004306
H  3.524441 2.312519 -0.571264
H  3.426546 -0.643115 -1.448641
H  5.243725 -1.013154 0.051766
H  4.152658 -1.49302 1.349373
H  5.356593 -0.238696 1.629779
H  2.246956 0.112388 2.083025
H  2.124519 1.700037 1.328836
H  3.473892 1.336325 2.396477
H  6.196937 1.282455 -0.564124
H  7.760724 1.375319 -2.26197
H  7.20286 0.637703 -3.764371
H  7.241521 2.381702 -3.61416
H  4.612128 0.727464 -4.306718
H  3.557432 1.608181 -3.199447
H  4.718422 2.471058 -4.201626
H  -0.567813 -1.109208 -2.842629
H  -0.628774 0.587528 -2.360703
H  -1.079003 0.91697 0.605555
H  -2.043705 -2.808193 -1.344374
H  -2.463341 0.270005 2.896793
H  -2.747483 -1.445906 3.092579
H  -4.953159 -2.421405 2.588001
H  -4.228593 1.744157 1.976466
H  -7.371012 -2.040478 2.323018
H  -6.645634 2.130618 1.720044
H  -8.229726 0.237708 1.889441
totalener: -1079.73235963 hartree
nucrepener: 2057.33108256 hartree
electener: -3137.06344219 hartree
oneelecener: -5553.04008348 hartree
twoeener: 2415.97664130 hartree
kineticenergy: 1074.91573180 hartree
xcener: -106.467066114454 hartree
chargesum: -0.0000000
charge: -0.257797 -0.405014 -0.254246 0.129239 -0.011090 -0.130055 -0.271383 -0.268088 -0.240690 0.364136 -0.007892 -0.210533 -0.224988 0.050682 -0.060375 -0.272058 -0.035999 0.234344 -0.138207 0.095044 -0.156464 -0.169475 -0.123310 -0.121191 -0.135337 0.105679 0.090875 0.085907 0.092287 0.088041 0.087862 0.096921 0.085187 0.092474 0.078670 0.084337 0.086619 0.086780 0.085353 0.090143 0.093246 0.114401 0.149716 0.133658 0.101846 0.104326 0.107528 0.107784 0.122859 0.124196 0.124053
qa: -0.2578 -0.4050 -0.2542 0.1292 -0.0111 -0.1301 -0.2714 -0.2681 -0.2407 0.3641 -0.0079 -0.2105 -0.2250 0.0507 -0.0604 -0.2721 -0.0360 0.2343 -0.1382 0.0950 -0.1565 -0.1695 -0.1233 -0.1212 -0.1353 0.1057 0.0909 0.0859 0.0923 0.0880 0.0879 0.0969 0.0852 0.0925 0.0787 0.0843 0.0866 0.0868 0.0854 0.0901 0.0932 0.1144 0.1497 0.1337 0.1018 0.1043 0.1075 0.1078 0.1229 0.1242 0.1241
va: 2.1270 2.0929 2.3136 3.7369 3.8087 3.8582 3.9065 3.9051 3.8945 4.1710 3.7429 3.9410 3.9395 3.9031 3.7319 4.0237 3.9996 3.6036 3.8876 3.6066 4.0141 4.0072 3.9559 3.9637 3.9634 1.0256 1.0296 1.0054 1.0060 1.0019 1.0018 1.0212 1.0035 1.0102 1.0099 0.9992 0.9989 1.0010 1.0155 1.0023 0.9977 1.0061 1.0215 1.0071 1.0111 1.0080 1.0147 1.0117 1.0005 1.0002 1.0000
dispcorr: -0.022883922 hartree
energy: -1079.755243552785
dipole: 28.74978 -28.39962 0.35016 5.92551 -6.32776 -0.40225 -4.16256 3.99356 -0.16901
magnitude: 0.55945 au
magnitude: 1.42201 debye
