program: Orca
programVersion: 5.0.2
elementType: O O O C C C C C C C C C C C C C C C C C C C C C C H H H H H H H H H H H H H H H H H H H H H H H H H H
charge: 0
multiplicity: 1
keywords: wb97x-d3
keywords: def2-TZVPP
keywords: def2/J RIJCOSX
keywords: DEFGRID2
keywords: scfconv7
keywords: smallprint printgap noloewdin
keywords: NOSOSCF
formula: C22H26O3
InChI: InChI=1/C22H26O3/c1-15(2)10-19-20(22(19,3)4)21(23)25-14-17-12-18(24-13-17)11-16-8-6-5-7-9-16/h5-10,12-13,19-20H,11,14H2,1-4H3
51 atoms
O  1.803102 -1.946518 0.094957
O  2.043615 -0.106965 1.347678
O  -2.62253 -1.797265 -0.268032
C  4.711142 0.179568 -0.282128
C  3.658714 1.087531 -0.840852
C  3.349035 -0.384697 -0.636843
C  5.858617 -0.263505 -1.159489
C  5.117828 0.361986 1.160118
C  3.702224 1.639422 -2.206539
C  2.347878 -0.763268 0.383879
C  3.356281 2.872182 -2.585322
C  3.426113 3.278404 -4.027487
C  2.868733 3.948929 -1.663671
C  0.765314 -2.43151 0.953654
C  -0.56942 -1.899026 0.570979
C  -1.095213 -0.582824 0.77682
C  -1.549697 -2.579789 -0.068175
C  -2.33934 -0.580071 0.244701
C  -3.387288 0.467377 0.144302
C  -4.643867 0.128945 0.910282
C  -4.606738 0.001253 2.29559
C  -5.85253 -0.057828 0.253893
C  -5.755253 -0.298964 3.0086
C  -7.006083 -0.360583 0.964581
C  -6.960686 -0.480726 2.343865
H  3.194578 1.721119 -0.093509
H  3.3271 -1.000652 -1.52902
H  6.63094 0.506685 -1.195716
H  5.558252 -0.475677 -2.184535
H  6.312576 -1.171593 -0.75926
H  5.4780 -0.577177 1.584514
H  4.30738 0.722808 1.787655
H  5.934422 1.083644 1.219547
H  4.034754 0.958369 -2.984156
H  3.804775 2.47913 -4.66282
H  2.439887 3.563845 -4.402204
H  4.072646 4.149026 -4.161338
H  2.836602 3.652592 -0.618133
H  3.508007 4.831882 -1.735302
H  1.863734 4.271319 -1.946908
H  0.996463 -2.200199 1.994457
H  0.786732 -3.51471 0.83557
H  -0.598504 0.245216 1.254395
H  -1.615251 -3.595556 -0.424507
H  -3.635757 0.650121 -0.905291
H  -2.95879 1.39831 0.522666
H  -3.666405 0.132501 2.818344
H  -5.894932 0.032744 -0.824967
H  -5.710671 -0.391923 4.085864
H  -7.940246 -0.504033 0.437398
H  -7.858785 -0.715055 2.9000
totalener: -1079.73374614 hartree
nucrepener: 2044.15878847 hartree
electener: -3123.89253460 hartree
oneelecener: -5526.66208047 hartree
twoeener: 2402.76954587 hartree
kineticenergy: 1074.91199977 hartree
xcener: -106.467501230474 hartree
chargesum: 0.0000000
charge: -0.260395 -0.414734 -0.249472 0.081423 0.043743 -0.084954 -0.250374 -0.256239 -0.181901 0.369973 -0.054322 -0.202828 -0.237448 0.058945 -0.070433 -0.259616 -0.037225 0.215217 -0.119965 0.055749 -0.155373 -0.140501 -0.129995 -0.125897 -0.129370 0.086544 0.071445 0.093000 0.071568 0.089809 0.082728 0.100438 0.084837 0.069909 0.076136 0.084636 0.082808 0.083519 0.084836 0.085912 0.111959 0.095209 0.152890 0.134039 0.093178 0.110973 0.114983 0.104160 0.124059 0.122364 0.124048
qa: -0.2604 -0.4147 -0.2495 0.0814 0.0437 -0.0850 -0.2504 -0.2562 -0.1819 0.3700 -0.0543 -0.2028 -0.2374 0.0589 -0.0704 -0.2596 -0.0372 0.2152 -0.1200 0.0557 -0.1554 -0.1405 -0.1300 -0.1259 -0.1294 0.0865 0.0714 0.0930 0.0716 0.0898 0.0827 0.1004 0.0848 0.0699 0.0761 0.0846 0.0828 0.0835 0.0848 0.0859 0.1120 0.0952 0.1529 0.1340 0.0932 0.1110 0.1150 0.1042 0.1241 0.1224 0.1240
va: 2.1357 2.0802 2.3144 3.7343 3.7853 3.8658 3.9193 3.9099 3.9095 4.1990 3.8323 3.9340 3.9446 3.8909 3.7407 4.0224 4.0021 3.6252 3.8764 3.6658 3.9901 3.9967 3.9675 3.9647 3.9584 1.0362 1.0373 1.0033 1.0107 1.0044 1.0029 1.0227 1.0008 1.0223 1.0124 0.9978 0.9985 1.0160 0.9994 0.9986 1.0087 0.9983 1.0207 1.0076 1.0093 1.0046 1.0118 1.0118 1.0009 1.0010 1.0000
dispcorr: -0.021500940 hartree
energy: -1079.755247074982
dipole: 24.41136 -24.18821 0.22315 15.60945 -15.64550 -0.03606 -9.58600 9.15321 -0.43279
magnitude: 0.48827 au
magnitude: 1.24107 debye
