program: Orca
programVersion: 5.0.2
elementType: O O O C C C C C C C C C C C C C C C C C C C C C C H H H H H H H H H H H H H H H H H H H H H H H H H H
charge: 0
multiplicity: 1
keywords: wb97x-d3
keywords: def2-TZVPP
keywords: def2/J RIJCOSX
keywords: DEFGRID2
keywords: scfconv7
keywords: smallprint printgap noloewdin
keywords: NOSOSCF
formula: C22H26O3
InChI: InChI=1/C22H26O3/c1-15(2)10-19-20(22(19,3)4)21(23)25-14-17-12-18(24-13-17)11-16-8-6-5-7-9-16/h5-10,12-13,19-20H,11,14H2,1-4H3
51 atoms
O  1.750584 -2.385227 -0.848033
O  2.03258 -1.572455 1.217311
O  -2.537453 -2.629132 -0.552427
C  3.856603 0.526026 -0.234599
C  2.492304 1.094839 0.014595
C  2.633291 -0.248333 -0.680467
C  4.70961 1.105742 -1.33844
C  4.668886 0.065773 0.951626
C  1.944229 2.247245 -0.724478
C  2.127594 -1.447409 0.022727
C  1.332002 3.313113 -0.201185
C  0.825361 4.41636 -1.08363
C  1.097885 3.532036 1.263017
C  1.004367 -3.499291 -0.337699
C  -0.41404 -3.108031 -0.121571
C  -0.973119 -2.412191 0.996918
C  -1.421579 -3.209667 -1.021053
C  -2.257361 -2.135511 0.673699
C  -3.290046 -1.298057 1.331348
C  -3.40237 0.076573 0.703311
C  -2.262842 0.800552 0.364045
C  -4.647248 0.647569 0.470398
C  -2.367601 2.062127 -0.198572
C  -4.755912 1.914484 -0.086211
C  -3.615393 2.625858 -0.424266
H  2.168103 1.002482 1.045163
H  2.458733 -0.255949 -1.750654
H  5.222399 2.004114 -0.990728
H  4.136251 1.377969 -2.223482
H  5.469407 0.386978 -1.649731
H  5.260171 0.899303 1.335321
H  5.364521 -0.724287 0.661565
H  4.055159 -0.312222 1.764966
H  2.048894 2.214948 -1.804967
H  1.344891 5.354947 -0.874108
H  0.954776 4.190835 -2.141389
H  -0.236828 4.609058 -0.90963
H  1.530351 2.760825 1.895641
H  1.521119 4.488712 1.578154
H  0.027973 3.578809 1.481976
H  1.461135 -3.884714 0.574475
H  1.084463 -4.264345 -1.108976
H  -0.465199 -2.130637 1.904176
H  -1.479457 -3.65391 -2.001959
H  -3.020769 -1.199456 2.386103
H  -4.263835 -1.793873 1.307907
H  -1.280869 0.371003 0.522858
H  -5.54476 0.094539 0.721863
H  -1.465791 2.595346 -0.471464
H  -5.734728 2.340967 -0.263062
H  -3.698018 3.609495 -0.867778
totalener: -1079.73160244 hartree
nucrepener: 2181.27674269 hartree
electener: -3261.00834514 hartree
oneelecener: -5800.81922490 hartree
twoeener: 2539.81087976 hartree
kineticenergy: 1074.91222596 hartree
xcener: -106.468953074352 hartree
chargesum: -0.0000000
charge: -0.261277 -0.409940 -0.245274 0.092978 0.031120 -0.072838 -0.245988 -0.257717 -0.161146 0.349335 -0.109651 -0.193678 -0.222865 0.059072 -0.067878 -0.283196 -0.029577 0.209857 -0.087361 0.069978 -0.200822 -0.171894 -0.072411 -0.089113 -0.184948 0.089229 0.071764 0.092947 0.071006 0.090901 0.084232 0.083249 0.101326 0.071432 0.094775 0.081104 0.072653 0.085697 0.088312 0.082161 0.111639 0.099823 0.155931 0.133915 0.100026 0.088308 0.130918 0.104576 0.128529 0.122337 0.118445
qa: -0.2613 -0.4099 -0.2453 0.0930 0.0311 -0.0728 -0.2460 -0.2577 -0.1611 0.3493 -0.1097 -0.1937 -0.2229 0.0591 -0.0679 -0.2832 -0.0296 0.2099 -0.0874 0.0700 -0.2008 -0.1719 -0.0724 -0.0891 -0.1849 0.0892 0.0718 0.0929 0.0710 0.0909 0.0842 0.0832 0.1013 0.0714 0.0948 0.0811 0.0727 0.0857 0.0883 0.0822 0.1116 0.0998 0.1559 0.1339 0.1000 0.0883 0.1309 0.1046 0.1285 0.1223 0.1184
va: 2.1311 2.0805 2.3147 3.7509 3.7658 3.8781 3.9180 3.9073 3.8697 4.2045 3.8654 3.9186 3.9370 3.8898 3.7170 3.9745 4.0004 3.6288 3.8823 3.7126 4.0340 4.0009 3.8869 3.9391 4.0159 1.0375 1.0388 1.0037 1.0105 1.0046 1.0009 1.0031 1.0228 1.0225 0.9977 1.0122 0.9993 1.0142 1.0014 1.0030 1.0085 0.9962 1.0190 1.0076 1.0016 1.0150 1.0042 1.0112 0.9895 1.0004 1.0049
dispcorr: -0.025427532 hartree
energy: -1079.757029976359
dipole: 15.57511 -15.47517 0.09994 21.85644 -21.58613 0.27031 0.02021 -0.39143 -0.37122
magnitude: 0.46996 au
magnitude: 1.19453 debye
