program: Orca
programVersion: 5.0.2
elementType: O O O C C C C C C C C C C C C C C C C C C C C C C H H H H H H H H H H H H H H H H H H H H H H H H H H
charge: 0
multiplicity: 1
keywords: wb97x-d3
keywords: def2-TZVPP
keywords: def2/J RIJCOSX
keywords: DEFGRID2
keywords: scfconv7
keywords: smallprint printgap noloewdin
keywords: NOSOSCF
formula: C22H26O3
InChI: InChI=1/C22H26O3/c1-15(2)10-19-20(22(19,3)4)21(23)25-14-17-12-18(24-13-17)11-16-8-6-5-7-9-16/h5-10,12-13,19-20H,11,14H2,1-4H3
51 atoms
O  0.998456 -1.069738 -1.538543
O  2.23953 -2.725727 -0.689142
O  -1.307175 -2.434063 1.890456
C  3.109077 0.595451 0.082393
C  3.150451 0.829374 -1.400443
C  3.207354 -0.578755 -0.876773
C  4.343772 0.872486 0.904269
C  1.825877 0.864985 0.831098
C  4.340019 1.393689 -2.090494
C  2.119525 -1.573547 -1.016906
C  4.696648 2.678415 -2.075929
C  5.900845 3.163654 -2.824552
C  3.936246 3.733332 -1.331656
C  -0.151665 -1.922214 -1.54593
C  -0.821295 -1.945346 -0.216279
C  -1.904702 -1.11735 0.219044
C  -0.506572 -2.721913 0.84833
C  -2.159977 -1.461713 1.503162
C  -3.151056 -0.985614 2.507781
C  -4.227923 -0.154117 1.866044
C  -5.264671 -0.767053 1.168508
C  -4.195924 1.233051 1.931638
C  -6.249999 -0.010622 0.555308
C  -5.180124 1.995275 1.317418
C  -6.210282 1.375122 0.628337
H  2.195623 1.111899 -1.835024
H  4.180841 -1.058426 -0.885415
H  4.384972 1.92435 1.194709
H  5.262313 0.648504 0.364084
H  4.335707 0.275688 1.8181
H  1.835103 1.884219 1.223682
H  1.718523 0.187992 1.680834
H  0.937931 0.759675 0.212128
H  4.94516 0.697449 -2.664473
H  6.61645 3.640944 -2.150234
H  6.415018 2.354093 -3.341081
H  5.625421 3.915343 -3.568447
H  4.586889 4.255986 -0.626033
H  3.554311 4.492169 -2.019478
H  3.091507 3.331873 -0.775258
H  0.124008 -2.92581 -1.870909
H  -0.812567 -1.49268 -2.29756
H  -2.430493 -0.37445 -0.359069
H  0.240159 -3.483626 0.998647
H  -2.646646 -0.405875 3.287529
H  -3.59514 -1.847475 3.015087
H  -5.297623 -1.848176 1.103027
H  -3.39319 1.723361 2.469327
H  -7.051539 -0.502691 0.020019
H  -5.141446 3.074868 1.380249
H  -6.979758 1.96701 0.150464
totalener: -1079.72972968 hartree
nucrepener: 2092.54239135 hartree
electener: -3172.27212103 hartree
oneelecener: -5623.24034036 hartree
twoeener: 2450.96821932 hartree
kineticenergy: 1074.91169560 hartree
xcener: -106.467086246774 hartree
chargesum: 0.0000000
charge: -0.263087 -0.380773 -0.254221 0.075601 0.012251 -0.095603 -0.251801 -0.275890 -0.217467 0.340963 -0.016931 -0.209957 -0.247353 0.035699 -0.085530 -0.255433 0.003420 0.175437 -0.057886 0.014165 -0.162087 -0.143586 -0.117610 -0.125566 -0.129336 0.103160 0.083945 0.081227 0.083633 0.099770 0.082756 0.100680 0.089036 0.090007 0.084253 0.079639 0.085265 0.088231 0.098001 0.082677 0.119404 0.098271 0.137674 0.157072 0.087345 0.101073 0.113764 0.108709 0.125502 0.125050 0.126438
qa: -0.2631 -0.3808 -0.2542 0.0756 0.0123 -0.0956 -0.2518 -0.2759 -0.2175 0.3410 -0.0169 -0.2100 -0.2474 0.0357 -0.0855 -0.2554 0.0034 0.1754 -0.0579 0.0142 -0.1621 -0.1436 -0.1176 -0.1256 -0.1293 0.1032 0.0839 0.0812 0.0836 0.0998 0.0828 0.1007 0.0890 0.0900 0.0843 0.0796 0.0853 0.0882 0.0980 0.0827 0.1194 0.0983 0.1377 0.1571 0.0873 0.1011 0.1138 0.1087 0.1255 0.1251 0.1264
va: 2.1048 2.1171 2.3060 3.7349 3.7787 3.8447 3.9049 3.9153 3.8665 4.2805 3.7357 3.9386 3.9378 3.8714 3.6831 3.9791 3.9626 3.6811 3.8484 3.6795 3.9861 3.9704 3.9520 3.9629 3.9551 1.0227 1.0311 1.0016 1.0076 1.0053 1.0047 1.0017 1.0161 1.0141 0.9989 1.0107 0.9981 0.9989 1.0035 1.0096 1.0087 0.9977 1.0088 1.0141 1.0066 1.0076 1.0098 1.0115 1.0001 1.0005 0.9996
dispcorr: -0.024483781 hartree
energy: -1079.754213465537
dipole: 20.38764 -20.78500 -0.39736 21.64097 -20.53948 1.10149 -3.47644 3.40688 -0.06956
magnitude: 1.17303 au
magnitude: 2.98161 debye
