program: Orca
programVersion: 5.0.2
elementType: O O O C C C C C C C C C C C C C C C C C C C C C C H H H H H H H H H H H H H H H H H H H H H H H H H H
charge: 0
multiplicity: 1
keywords: wb97x-d3
keywords: def2-TZVPP
keywords: def2/J RIJCOSX
keywords: DEFGRID2
keywords: scfconv7
keywords: smallprint printgap noloewdin
keywords: NOSOSCF
formula: C22H26O3
InChI: InChI=1/C22H26O3/c1-15(2)10-19-20(22(19,3)4)21(23)25-14-17-12-18(24-13-17)11-16-8-6-5-7-9-16/h5-10,12-13,19-20H,11,14H2,1-4H3
51 atoms
O  1.03286 -1.164425 -1.435193
O  2.378686 -2.646537 -0.436973
O  -1.303436 -2.545648 1.992682
C  2.945235 0.803954 0.063202
C  3.039326 0.894038 -1.433101
C  3.177237 -0.447103 -0.766026
C  4.116317 1.263455 0.896701
C  1.612977 1.04281 0.73269
C  4.215824 1.488733 -2.120844
C  2.176054 -1.535181 -0.852322
C  4.428955 2.796372 -2.271136
C  5.633132 3.316575 -2.995827
C  3.496854 3.843908 -1.742846
C  -0.03957 -2.111964 -1.415658
C  -0.749571 -2.10484 -0.107859
C  -1.854221 -1.275736 0.269108
C  -0.463253 -2.848825 0.98681
C  -2.149576 -1.589308 1.552201
C  -3.176229 -1.095917 2.511641
C  -4.181691 -0.207213 1.832453
C  -4.086989 1.176104 1.916738
C  -5.213072 -0.762452 1.080855
C  -5.004357 1.991058 1.267932
C  -6.131221 0.046898 0.431834
C  -6.029387 1.428128 0.524152
H  2.088158 1.055267 -1.932482
H  4.183315 -0.846849 -0.689834
H  4.064715 2.340418 1.070117
H  5.073649 1.057069 0.420417
H  4.110009 0.768701 1.869456
H  1.529443 2.092917 1.021033
H  1.519553 0.445087 1.641387
H  0.763635 0.808212 0.095768
H  4.939344 0.795922 -2.541266
H  5.343731 3.92245 -3.858486
H  6.231173 3.963009 -2.348451
H  6.275959 2.512399 -3.352768
H  3.115972 4.468514 -2.555228
H  2.642593 3.423046 -1.215653
H  4.017388 4.515533 -1.055111
H  0.329909 -3.107752 -1.66182
H  -0.708215 -1.792143 -2.213749
H  -2.365951 -0.550011 -0.342526
H  0.288261 -3.595551 1.182841
H  -2.692031 -0.554522 3.330753
H  -3.682995 -1.948716 2.973998
H  -3.287282 1.622295 2.495764
H  -5.294135 -1.840082 1.001301
H  -4.918109 3.066839 1.346712
H  -6.929713 -0.400737 -0.145345
H  -6.747502 2.061141 0.019792
totalener: -1079.73003863 hartree
nucrepener: 2096.77248687 hartree
electener: -3176.50252550 hartree
oneelecener: -5631.70865577 hartree
twoeener: 2455.20613027 hartree
kineticenergy: 1074.90887370 hartree
xcener: -106.466335639587 hartree
chargesum: 0.0000000
charge: -0.263768 -0.379243 -0.254391 0.083163 0.009794 -0.097386 -0.250248 -0.282397 -0.215970 0.341542 -0.019507 -0.210510 -0.245182 0.035579 -0.080523 -0.263780 0.004588 0.178004 -0.055806 0.016336 -0.144845 -0.163465 -0.125300 -0.118922 -0.128825 0.103345 0.083116 0.082077 0.083023 0.098664 0.083881 0.101163 0.090721 0.090940 0.085551 0.083488 0.080066 0.097356 0.082112 0.087648 0.118028 0.098570 0.138649 0.155575 0.087518 0.099941 0.109020 0.113519 0.124730 0.125961 0.126401
qa: -0.2638 -0.3792 -0.2544 0.0832 0.0098 -0.0974 -0.2502 -0.2824 -0.2160 0.3415 -0.0195 -0.2105 -0.2452 0.0356 -0.0805 -0.2638 0.0046 0.1780 -0.0558 0.0163 -0.1448 -0.1635 -0.1253 -0.1189 -0.1288 0.1033 0.0831 0.0821 0.0830 0.0987 0.0839 0.1012 0.0907 0.0909 0.0856 0.0835 0.0801 0.0974 0.0821 0.0876 0.1180 0.0986 0.1386 0.1556 0.0875 0.0999 0.1090 0.1135 0.1247 0.1260 0.1264
va: 2.1033 2.1209 2.3063 3.7206 3.7812 3.8591 3.9066 3.9137 3.8623 4.2803 3.7371 3.9400 3.9386 3.8785 3.6808 3.9783 3.9724 3.6793 3.8528 3.6730 3.9741 3.9848 3.9629 3.9527 3.9548 1.0222 1.0314 1.0018 1.0076 1.0050 1.0040 1.0016 1.0159 1.0140 0.9983 0.9987 1.0106 1.0031 1.0097 0.9992 1.0094 0.9969 1.0087 1.0134 1.0077 1.0066 1.0114 1.0102 1.0006 1.0000 0.9996
dispcorr: -0.024442324 hartree
energy: -1079.754480952931
dipole: 18.48407 -18.96350 -0.47944 22.96112 -21.88943 1.07169 -5.16092 4.99269 -0.16823
magnitude: 1.18603 au
magnitude: 3.01465 debye
