program: Orca
programVersion: 5.0.2
elementType: O O O C C C C C C C C C C C C C C C C C C C C C C H H H H H H H H H H H H H H H H H H H H H H H H H H
charge: 0
multiplicity: 1
keywords: wb97x-d3
keywords: def2-TZVPP
keywords: def2/J RIJCOSX
keywords: DEFGRID2
keywords: scfconv7
keywords: smallprint printgap noloewdin
keywords: NOSOSCF
formula: C22H26O3
InChI: InChI=1/C22H26O3/c1-15(2)10-19-20(22(19,3)4)21(23)25-14-17-12-18(24-13-17)11-16-8-6-5-7-9-16/h5-10,12-13,19-20H,11,14H2,1-4H3
51 atoms
O  1.713347 -2.063559 -0.174926
O  0.845073 -0.976356 -1.928407
O  -2.159672 -2.854633 1.611028
C  1.700007 1.494213 -0.18485
C  2.64078 1.32633 -1.34246
C  2.348301 0.145565 -0.444498
C  2.156606 2.223359 1.056446
C  0.234298 1.711169 -0.476223
C  3.996865 1.905574 -1.35926
C  1.554492 -0.992389 -0.955351
C  4.575607 2.566399 -2.364516
C  5.975125 3.090806 -2.233506
C  3.928088 2.853692 -3.684915
C  0.864843 -3.191502 -0.415725
C  -0.492741 -2.966532 0.15054
C  -1.604358 -2.30179 -0.458258
C  -0.900949 -3.276625 1.403848
C  -2.58249 -2.258252 0.474959
C  -3.920159 -1.610479 0.502082
C  -3.874748 -0.292664 1.240007
C  -3.456557 0.860789 0.58461
C  -4.195201 -0.216202 2.589626
C  -3.364656 2.066679 1.261037
C  -4.10299 0.9891 3.271092
C  -3.688269 2.134192 2.608806
H  2.141717 1.266194 -2.303194
H  3.120237 -0.131465 0.265263
H  2.05751 3.302171 0.923444
H  3.194264 2.019499 1.317195
H  1.541827 1.935465 1.910809
H  -0.388837 1.316773 0.328962
H  -0.085623 1.245463 -1.404903
H  0.035307 2.78199 -0.553251
H  4.583199 1.767795 -0.455365
H  6.003384 4.175166 -2.368184
H  6.411026 2.862942 -1.261553
H  6.627342 2.665901 -3.000895
H  3.902521 3.930201 -3.871689
H  4.504633 2.411942 -4.501322
H  2.90847 2.484823 -3.764293
H  1.360314 -4.021995 0.085951
H  0.818685 -3.417845 -1.481786
H  -1.646051 -1.896332 -1.455183
H  -0.415479 -3.780411 2.22442
H  -4.656262 -2.275844 0.960332
H  -4.242015 -1.451309 -0.528483
H  -3.192088 0.813212 -0.465472
H  -4.517304 -1.107323 3.114757
H  -3.038786 2.954571 0.734864
H  -4.355915 1.033111 4.322398
H  -3.618699 3.074874 3.138943
totalener: -1079.73225123 hartree
nucrepener: 2135.12166563 hartree
electener: -3214.85391686 hartree
oneelecener: -5708.66027477 hartree
twoeener: 2493.80635791 hartree
kineticenergy: 1074.91487881 hartree
xcener: -106.467790571585 hartree
chargesum: 0.0000000
charge: -0.259751 -0.402601 -0.250988 0.104510 0.044607 -0.088854 -0.250200 -0.283591 -0.186218 0.363380 -0.053034 -0.204239 -0.236751 0.045937 -0.054982 -0.284309 -0.031919 0.239295 -0.136092 0.124426 -0.214555 -0.164632 -0.124995 -0.116835 -0.133363 0.087547 0.069222 0.090152 0.070826 0.094939 0.099332 0.095288 0.085544 0.069766 0.082845 0.076370 0.084559 0.083705 0.086686 0.082729 0.098623 0.113189 0.141873 0.133701 0.102810 0.105638 0.116261 0.108130 0.128402 0.123368 0.124247
qa: -0.2598 -0.4026 -0.2510 0.1045 0.0446 -0.0889 -0.2502 -0.2836 -0.1862 0.3634 -0.0530 -0.2042 -0.2368 0.0459 -0.0550 -0.2843 -0.0319 0.2393 -0.1361 0.1244 -0.2146 -0.1646 -0.1250 -0.1168 -0.1334 0.0875 0.0692 0.0902 0.0708 0.0949 0.0993 0.0953 0.0855 0.0698 0.0828 0.0764 0.0846 0.0837 0.0867 0.0827 0.0986 0.1132 0.1419 0.1337 0.1028 0.1056 0.1163 0.1081 0.1284 0.1234 0.1242
va: 2.1331 2.1012 2.3099 3.7431 3.7883 3.8775 3.9101 3.9219 3.9030 4.2275 3.8261 3.9343 3.9455 3.9070 3.7061 4.0122 3.9969 3.5842 3.8837 3.5614 3.9827 4.0231 3.9348 3.9525 3.9634 1.0348 1.0384 1.0041 1.0109 1.0043 0.9941 1.0223 1.0019 1.0217 0.9983 1.0123 0.9980 0.9992 0.9989 1.0162 0.9968 1.0060 1.0250 1.0070 1.0130 1.0100 1.0074 1.0140 0.9979 1.0000 0.9995
dispcorr: -0.024267187 hartree
energy: -1079.756518416329
dipole: 17.94892 -17.75457 0.19435 22.02646 -21.84803 0.17844 -7.49915 7.86772 0.36856
magnitude: 0.45327 au
magnitude: 1.15211 debye
