program: Orca
programVersion: 5.0.2
elementType: O O O C C C C C C C C C C C C C C C C C C C C C C H H H H H H H H H H H H H H H H H H H H H H H H H H
charge: 0
multiplicity: 1
keywords: wb97x-d3
keywords: def2-TZVPP
keywords: def2/J RIJCOSX
keywords: DEFGRID2
keywords: scfconv7
keywords: smallprint printgap noloewdin
keywords: NOSOSCF
formula: C22H26O3
InChI: InChI=1/C22H26O3/c1-15(2)10-19-20(22(19,3)4)21(23)25-14-17-12-18(24-13-17)11-16-8-6-5-7-9-16/h5-10,12-13,19-20H,11,14H2,1-4H3
51 atoms
O  1.783406 -2.190693 -0.983749
O  2.456357 -1.822166 1.118349
O  -1.895049 -2.004222 1.332948
C  4.130902 0.523976 -0.157012
C  2.823791 1.031349 0.345516
C  2.853163 -0.178258 -0.57531
C  4.829317 1.284831 -1.259378
C  5.084802 -0.130221 0.812129
C  2.198949 2.292671 -0.127732
C  2.381663 -1.465398 -0.030143
C  0.89043 2.44734 -0.339592
C  0.323648 3.745916 -0.827527
C  -0.11467 1.356211 -0.127895
C  0.975272 -3.284809 -0.54273
C  -0.328867 -2.782656 -0.030232
C  -1.460633 -2.367967 -0.802238
C  -0.658116 -2.527669 1.25781
C  -2.379124 -1.90435 0.076487
C  -3.725082 -1.294199 -0.093807
C  -3.711799 0.204901 0.096883
C  -3.683436 1.057855 -1.000268
C  -3.700028 0.758388 1.373598
C  -3.644961 2.43398 -0.830149
C  -3.659801 2.133181 1.548016
C  -3.631463 2.976271 0.445956
H  2.618218 0.770255 1.381159
H  2.542049 0.007726 -1.596534
H  5.485669 0.623286 -1.826984
H  5.446059 2.084215 -0.843094
H  4.128998 1.739232 -1.960383
H  4.573458 -0.653755 1.615663
H  5.730743 0.62702 1.260741
H  5.727388 -0.848493 0.299374
H  2.858669 3.139816 -0.293904
H  1.094582 4.496929 -0.996866
H  -0.221263 3.602167 -1.764088
H  -0.396765 4.15082 -0.112605
H  0.285551 0.492606 0.397694
H  -0.970203 1.723292 0.442404
H  -0.516425 1.005538 -1.08195
H  1.496458 -3.87895 0.208676
H  0.833571 -3.90507 -1.427081
H  -1.566439 -2.407643 -1.874715
H  -0.121395 -2.655835 2.183218
H  -4.4327 -1.752293 0.603163
H  -4.079773 -1.536922 -1.096629
H  -3.690388 0.642295 -2.001108
H  -3.720736 0.109037 2.240138
H  -3.624416 3.082841 -1.69602
H  -3.651223 2.547634 2.54762
H  -3.602673 4.04943 0.581652
totalener: -1079.73120887 hartree
nucrepener: 2219.42861552 hartree
electener: -3299.15982439 hartree
oneelecener: -5877.34564997 hartree
twoeener: 2578.18582558 hartree
kineticenergy: 1074.91303467 hartree
xcener: -106.469339914701 hartree
chargesum: 0.0000000
charge: -0.264509 -0.399243 -0.256034 0.146237 -0.020927 -0.088817 -0.272345 -0.261084 -0.248293 0.315312 0.046400 -0.238536 -0.219781 0.068338 -0.074550 -0.287364 0.003631 0.231241 -0.134351 0.097382 -0.192588 -0.162260 -0.089848 -0.097605 -0.174631 0.102588 0.079622 0.090265 0.089779 0.084141 0.100514 0.081369 0.083635 0.092093 0.083325 0.082988 0.086912 0.075406 0.077372 0.087799 0.110588 0.099879 0.122340 0.150181 0.111291 0.092963 0.104213 0.111625 0.123114 0.125117 0.125108
qa: -0.2645 -0.3992 -0.2560 0.1462 -0.0209 -0.0888 -0.2723 -0.2611 -0.2483 0.3153 0.0464 -0.2385 -0.2198 0.0683 -0.0746 -0.2874 0.0036 0.2312 -0.1344 0.0974 -0.1926 -0.1623 -0.0898 -0.0976 -0.1746 0.1026 0.0796 0.0903 0.0898 0.0841 0.1005 0.0814 0.0836 0.0921 0.0833 0.0830 0.0869 0.0754 0.0774 0.0878 0.1106 0.0999 0.1223 0.1502 0.1113 0.0930 0.1042 0.1116 0.1231 0.1251 0.1251
va: 2.1116 2.0929 2.3000 3.7175 3.8260 3.8131 3.9065 3.8994 3.8881 4.2319 3.7134 3.9476 3.9646 3.8733 3.7036 4.0205 3.9541 3.5945 3.8755 3.5918 3.9597 4.0037 3.8802 3.9061 3.9436 1.0285 1.0356 1.0065 1.0013 1.0052 1.0225 1.0019 1.0024 1.0102 1.0129 0.9981 1.0000 1.0218 1.0052 0.9999 1.0126 0.9930 1.0183 1.0124 1.0063 1.0144 1.0121 1.0206 1.0009 1.0004 1.0026
dispcorr: -0.028611305 hartree
energy: -1079.759820178039
dipole: 11.55494 -12.08264 -0.52770 16.32097 -16.06267 0.25830 -5.15348 4.48581 -0.66767
magnitude: 0.88937 au
magnitude: 2.26059 debye
