program: Orca
programVersion: 5.0.2
elementType: O O O C C C C C C C C C C C C C C C C C C C C C C H H H H H H H H H H H H H H H H H H H H H H H H H H
charge: 0
multiplicity: 1
keywords: wb97x-d3
keywords: def2-TZVPP
keywords: def2/J RIJCOSX
keywords: DEFGRID2
keywords: scfconv7
keywords: smallprint printgap noloewdin
keywords: NOSOSCF
formula: C22H26O3
InChI: InChI=1/C22H26O3/c1-15(2)10-19-20(22(19,3)4)21(23)25-14-17-12-18(24-13-17)11-16-8-6-5-7-9-16/h5-10,12-13,19-20H,11,14H2,1-4H3
51 atoms
O  1.598799 -2.022325 -0.511336
O  0.71573 -0.769534 -2.145127
O  -2.164174 -2.977304 1.393478
C  1.38348 1.41026 0.061192
C  2.223854 1.587125 -1.161001
C  2.150346 0.226669 -0.514095
C  1.892846 1.923329 1.386036
C  -0.119215 1.487716 -0.065442
C  3.489755 2.365394 -1.143572
C  1.414293 -0.873209 -1.169436
C  4.577319 2.082889 -1.861938
C  5.799306 2.949064 -1.804332
C  4.672226 0.903775 -2.781096
C  0.731026 -3.114334 -0.835448
C  -0.586689 -2.935147 -0.16675
C  -1.676312 -2.105793 -0.58094
C  -0.950861 -3.434079 1.038384
C  -2.599067 -2.161282 0.406588
C  -3.872363 -1.423361 0.62957
C  -3.6221 -0.043728 1.195982
C  -3.101172 0.111868 2.478123
C  -3.870797 1.091525 0.434917
C  -2.835837 1.374355 2.983712
C  -3.607189 2.357711 0.938986
C  -3.087426 2.502734 2.215128
H  1.654353 1.656989 -2.084867
H  3.007375 -0.08684 0.071791
H  1.626418 2.973895 1.521176
H  2.975817 1.840847 1.478735
H  1.443495 1.362544 2.207234
H  -0.478969 1.164682 -1.039378
H  -0.445832 2.5190 0.079037
H  -0.618387 0.88205 0.693233
H  3.505486 3.253506 -0.517529
H  6.034817 3.362204 -2.788289
H  5.679408 3.781262 -1.111637
H  6.67441 2.373789 -1.491565
H  5.487063 0.24032 -2.47965
H  3.756938 0.317269 -2.81872
H  4.900885 1.229084 -3.799103
H  1.239492 -4.000409 -0.456985
H  0.623918 -3.217528 -1.91585
H  -1.739681 -1.525326 -1.485822
H  -0.462646 -4.104286 1.727712
H  -4.521249 -1.995998 1.296982
H  -4.403376 -1.337959 -0.320032
H  -2.896892 -0.761993 3.085057
H  -4.27311 0.987059 -0.565827
H  -2.43159 1.478789 3.982256
H  -3.807724 3.230461 0.3312
H  -2.880161 3.488441 2.610406
totalener: -1079.72995427 hartree
nucrepener: 2187.82932740 hartree
electener: -3267.55928166 hartree
oneelecener: -5814.19774886 hartree
twoeener: 2546.63846720 hartree
kineticenergy: 1074.90901217 hartree
xcener: -106.466672850029 hartree
chargesum: -0.0000000
charge: -0.258697 -0.393824 -0.255538 0.184583 -0.021121 -0.127596 -0.284509 -0.273095 -0.241552 0.353782 -0.007275 -0.211583 -0.223523 0.050308 -0.041632 -0.313955 -0.034946 0.264048 -0.113446 0.025296 -0.146735 -0.133500 -0.126086 -0.131951 -0.131483 0.106261 0.083191 0.088241 0.085421 0.092328 0.092368 0.084867 0.082149 0.092058 0.086440 0.078080 0.083613 0.084519 0.082234 0.088578 0.095682 0.113320 0.147725 0.134967 0.108763 0.093411 0.113342 0.104203 0.124172 0.123821 0.124272
qa: -0.2587 -0.3938 -0.2555 0.1846 -0.0211 -0.1276 -0.2845 -0.2731 -0.2416 0.3538 -0.0073 -0.2116 -0.2235 0.0503 -0.0416 -0.3140 -0.0349 0.2640 -0.1134 0.0253 -0.1467 -0.1335 -0.1261 -0.1320 -0.1315 0.1063 0.0832 0.0882 0.0854 0.0923 0.0924 0.0849 0.0821 0.0921 0.0864 0.0781 0.0836 0.0845 0.0822 0.0886 0.0957 0.1133 0.1477 0.1350 0.1088 0.0934 0.1133 0.1042 0.1242 0.1238 0.1243
va: 2.1256 2.1059 2.3012 3.7317 3.8285 3.8487 3.9050 3.8983 3.8996 4.2057 3.7351 3.9413 3.9400 3.9060 3.7180 3.9847 3.9880 3.5433 3.8512 3.7053 3.9550 3.9404 3.9432 3.9358 3.9299 1.0249 1.0329 1.0016 1.0055 1.0064 1.0206 1.0053 0.9984 1.0093 0.9985 1.0097 0.9993 1.0010 1.0200 1.0018 0.9965 1.0074 1.0225 1.0071 1.0120 1.0122 1.0209 1.0116 1.0008 1.0014 1.0003
dispcorr: -0.027074200 hartree
energy: -1079.757028465461
dipole: 18.21665 -18.04411 0.17254 17.66917 -17.61951 0.04966 -3.30085 3.77174 0.47090
magnitude: 0.50397 au
magnitude: 1.28098 debye
