program: Orca
programVersion: 5.0.2
elementType: O O O C C C C C C C C C C C C C C C C C C C C C C H H H H H H H H H H H H H H H H H H H H H H H H H H
charge: 0
multiplicity: 1
keywords: wb97x-d3
keywords: def2-TZVPP
keywords: def2/J RIJCOSX
keywords: DEFGRID2
keywords: scfconv7
keywords: smallprint printgap noloewdin
keywords: NOSOSCF
formula: C22H26O3
InChI: InChI=1/C22H26O3/c1-15(2)10-19-20(22(19,3)4)21(23)25-14-17-12-18(24-13-17)11-16-8-6-5-7-9-16/h5-10,12-13,19-20H,11,14H2,1-4H3
51 atoms
O  0.643272 -0.423558 -0.77013
O  1.825325 -0.090265 -2.632935
O  -2.579649 -2.904089 0.750032
C  3.440887 1.878974 -0.785876
C  4.179354 0.580553 -0.903396
C  2.712571 0.576474 -0.508473
C  3.681638 2.765339 0.412428
C  3.161729 2.662379 -2.04449
C  5.17877 0.129793 0.08539
C  1.713026 0.007624 -1.432258
C  6.392853 -0.367001 -0.174363
C  7.291221 -0.813423 0.9402
C  6.979035 -0.527584 -1.54378
C  -0.391676 -1.072627 -1.529218
C  -1.409812 -1.558116 -0.565954
C  -2.42002 -0.793769 0.103763
C  -1.559086 -2.82885 -0.127424
C  -3.100102 -1.661366 0.890054
C  -4.236522 -1.510444 1.83979
C  -4.968051 -0.213729 1.625589
C  -5.936609 -0.11246 0.629695
C  -4.677002 0.908709 2.393587
C  -6.606013 1.08234 0.411251
C  -5.343158 2.108297 2.17541
C  -6.309837 2.198225 1.184083
H  4.357589 0.270526 -1.927668
H  2.506315 0.3890 0.539719
H  2.848642 3.457986 0.548184
H  4.58578 3.361212 0.269849
H  3.796324 2.207661 1.341275
H  2.230201 3.225851 -1.955913
H  3.094942 2.040127 -2.933807
H  3.964293 3.383823 -2.211198
H  4.880018 0.20096 1.127526
H  7.569216 -1.864273 0.821252
H  8.226572 -0.247066 0.945193
H  6.824893 -0.699709 1.918954
H  7.228771 -1.573531 -1.736946
H  6.327067 -0.187203 -2.345314
H  7.915099 0.030805 -1.623066
H  0.027726 -1.90556 -2.097179
H  -0.826375 -0.364399 -2.237738
H  -2.608924 0.263215 -0.001431
H  -1.03975 -3.74736 -0.354843
H  -3.868171 -1.567122 2.86907
H  -4.924747 -2.351178 1.714815
H  -6.172018 -0.978995 0.022381
H  -3.925447 0.845072 3.172049
H  -7.36036 1.142821 -0.363079
H  -5.107618 2.972235 2.783941
H  -6.832316 3.131238 1.015611
elementType: O C H
totalener: -1079.75553568 hartree
nucrepener: 2006.24077114 hartree
electener: -3085.99630682 hartree
oneelecener: -5451.37437901 hartree
twoeener: 2365.37807219 hartree
cpcmener: -0.02555696 hartree
kineticenergy: 1074.85744587 hartree
xcener: -106.459786308269 hartree
chargesum: 0.0000000
charge: -0.274265 -0.480896 -0.278457 0.105966 0.043735 -0.091603 -0.265381 -0.276960 -0.274319 0.398561 -0.049671 -0.218017 -0.252200 0.088614 -0.106107 -0.282423 -0.027359 0.168919 -0.005338 -0.004149 -0.194322 -0.181987 -0.149265 -0.154397 -0.167379 0.090646 0.085022 0.096933 0.095953 0.087155 0.096923 0.092563 0.094314 0.116018 0.092780 0.093050 0.087436 0.095727 0.089874 0.095380 0.107713 0.111833 0.161962 0.175262 0.103333 0.107192 0.140260 0.139404 0.156676 0.157057 0.158236
qa: -0.2743 -0.4809 -0.2785 0.1060 0.0437 -0.0916 -0.2654 -0.2770 -0.2743 0.3986 -0.0497 -0.2180 -0.2522 0.0886 -0.1061 -0.2824 -0.0274 0.1689 -0.0053 -0.0041 -0.1943 -0.1820 -0.1493 -0.1544 -0.1674 0.0906 0.0850 0.0969 0.0960 0.0872 0.0969 0.0926 0.0943 0.1160 0.0928 0.0930 0.0874 0.0957 0.0899 0.0954 0.1077 0.1118 0.1620 0.1753 0.1033 0.1072 0.1403 0.1394 0.1567 0.1571 0.1582
va: 2.1219 2.0253 2.2770 3.6895 3.7600 3.8730 3.9111 3.9017 3.8731 4.1504 3.7640 3.9212 3.9421 3.8456 3.7859 3.9601 3.9459 3.6834 3.8136 3.6390 3.9365 3.9218 3.8931 3.8976 3.8963 1.0338 1.0373 1.0021 1.0023 1.0061 0.9996 1.0203 1.0004 1.0115 0.9961 0.9964 1.0093 0.9969 1.0101 0.9972 1.0021 0.9929 1.0035 0.9952 1.0039 1.0087 1.0036 1.0045 0.9908 0.9909 0.9902
dispcorr: -0.020951056 hartree
energy: -1079.776486734163
dipole: 31.23697 -31.28129 -0.04432 10.81183 -10.60112 0.21070 -0.24648 1.17414 0.92765
magnitude: 0.95231 au
magnitude: 2.42059 debye
