program: Orca
programVersion: 5.0.2
elementType: O O O C C C C C C C C C C C C C C C C C C C C C C H H H H H H H H H H H H H H H H H H H H H H H H H H
charge: 0
multiplicity: 1
keywords: wb97x-d3
keywords: def2-TZVPP
keywords: def2/J RIJCOSX
keywords: DEFGRID2
keywords: scfconv7
keywords: smallprint printgap noloewdin
keywords: NOSOSCF
formula: C22H26O3
InChI: InChI=1/C22H26O3/c1-15(2)10-19-20(22(19,3)4)21(23)25-14-17-12-18(24-13-17)11-16-8-6-5-7-9-16/h5-10,12-13,19-20H,11,14H2,1-4H3
51 atoms
O  1.095532 -0.978552 0.0938
O  2.776776 -0.569031 1.503972
O  -2.62327 -3.27033 -0.185134
C  4.350871 -0.121932 -1.182507
C  3.999649 1.204451 -0.57828
C  2.915198 0.160582 -0.773559
C  4.595529 -0.225145 -2.668806
C  5.2163 -1.06178 -0.379461
C  3.956709 2.457223 -1.355386
C  2.292932 -0.483251 0.398652
C  4.490139 3.616949 -0.959989
C  4.397715 4.843497 -1.814758
C  5.215011 3.779609 0.350753
C  0.3839 -1.671534 1.133601
C  -0.946767 -2.052358 0.600382
C  -2.086247 -1.206544 0.403117
C  -1.339389 -3.290692 0.222929
C  -3.076355 -1.998825 -0.072234
C  -4.485364 -1.740238 -0.482075
C  -5.093932 -0.594634 0.28336
C  -5.386463 -0.7371 1.639031
C  -5.366948 0.619413 -0.335589
C  -5.941756 0.310115 2.357196
C  -5.923001 1.672719 0.381964
C  -6.211117 1.521006 1.729733
H  4.323111 1.313071 0.452308
H  2.237121 0.327624 -1.603378
H  4.468502 -1.256692 -3.003654
H  5.616279 0.077314 -2.912216
H  3.917676 0.392712 -3.256595
H  4.988754 -2.10486 -0.609837
H  5.117979 -0.925325 0.695062
H  6.265133 -0.893264 -0.632934
H  3.449339 2.422713 -2.314978
H  5.3919 5.219393 -2.072073
H  3.856606 4.659893 -2.743316
H  3.891356 5.654754 -1.28437
H  4.569332 3.57017 1.206327
H  6.075697 3.112744 0.430629
H  5.586127 4.797202 0.472924
H  0.278546 -1.022643 2.005379
H  0.944534 -2.558229 1.437586
H  -2.15127 -0.148478 0.604553
H  -0.835191 -4.244866 0.207211
H  -5.073384 -2.64802 -0.321076
H  -4.531633 -1.534284 -1.555811
H  -5.17835 -1.678033 2.135844
H  -5.1455 0.745322 -1.3890
H  -6.167232 0.181517 3.408385
H  -6.130568 2.61182 -0.115267
H  -6.644849 2.339243 2.290373
elementType: O C H
totalener: -1079.75373192 hartree
nucrepener: 2005.70519252 hartree
electener: -3085.45892444 hartree
oneelecener: -5450.34051295 hartree
twoeener: 2364.88158851 hartree
cpcmener: -0.02536426 hartree
kineticenergy: 1074.84545238 hartree
xcener: -106.456788715610 hartree
chargesum: -0.0000000
charge: -0.275248 -0.480423 -0.276721 0.103675 0.051281 -0.102665 -0.269313 -0.278886 -0.296221 0.403869 -0.011970 -0.221626 -0.285428 0.084912 -0.098407 -0.298040 -0.025364 0.183836 -0.022631 -0.001080 -0.206489 -0.171332 -0.142893 -0.152766 -0.170857 0.089520 0.087218 0.097311 0.096579 0.087132 0.097519 0.092298 0.095722 0.115916 0.096410 0.084291 0.096627 0.102381 0.105176 0.094777 0.109518 0.112182 0.162521 0.174135 0.110786 0.099021 0.143042 0.139569 0.156709 0.156733 0.157695
qa: -0.2752 -0.4804 -0.2767 0.1037 0.0513 -0.1027 -0.2693 -0.2789 -0.2962 0.4039 -0.0120 -0.2216 -0.2854 0.0849 -0.0984 -0.2980 -0.0254 0.1838 -0.0226 -0.0011 -0.2065 -0.1713 -0.1429 -0.1528 -0.1709 0.0895 0.0872 0.0973 0.0966 0.0871 0.0975 0.0923 0.0957 0.1159 0.0964 0.0843 0.0966 0.1024 0.1052 0.0948 0.1095 0.1122 0.1625 0.1741 0.1108 0.0990 0.1430 0.1396 0.1567 0.1567 0.1577
va: 2.1206 2.0255 2.2807 3.6999 3.7518 3.8875 3.9143 3.9047 3.8987 4.1508 3.6959 3.9201 3.9401 3.8446 3.7656 3.9596 3.9429 3.6518 3.7972 3.6436 3.9373 3.9165 3.8840 3.8972 3.8993 1.0298 1.0354 1.0020 1.0018 1.0064 0.9995 1.0200 1.0001 1.0107 0.9928 1.0103 0.9928 0.9970 0.9953 1.0047 0.9945 1.0006 1.0043 0.9959 1.0087 1.0048 1.0018 1.0041 0.9906 0.9910 0.9904
dispcorr: -0.021014595 hartree
energy: -1079.774746519754
dipole: 27.28250 -27.61368 -0.33118 17.08943 -16.86028 0.22915 -7.98344 7.18155 -0.80189
magnitude: 0.89734 au
magnitude: 2.28085 debye
