program: Orca
programVersion: 5.0.2
elementType: O O O C C C C C C C C C C C C C C C C C C C C C C H H H H H H H H H H H H H H H H H H H H H H H H H H
charge: 0
multiplicity: 1
keywords: wb97x-d3
keywords: def2-TZVPP
keywords: def2/J RIJCOSX
keywords: DEFGRID2
keywords: scfconv7
keywords: smallprint printgap noloewdin
keywords: NOSOSCF
formula: C22H26O3
InChI: InChI=1/C22H26O3/c1-15(2)10-19-20(22(19,3)4)21(23)25-14-17-12-18(24-13-17)11-16-8-6-5-7-9-16/h5-10,12-13,19-20H,11,14H2,1-4H3
51 atoms
O  1.146082 0.432735 -0.074149
O  2.61623 1.947835 0.647389
O  -3.182711 0.031522 -0.703336
C  4.672285 -0.382485 0.157453
C  4.71603 0.588835 -0.969975
C  3.377569 0.013031 -0.539295
C  5.116567 -1.805713 -0.082169
C  4.971965 0.099685 1.555565
C  5.285024 0.252133 -2.300654
C  2.381334 0.904341 0.080963
C  4.886667 0.786489 -3.458087
C  5.540524 0.420366 -4.755208
C  3.772424 1.781045 -3.56645
C  0.069524 1.236523 0.435583
C  -1.202727 0.526398 0.160413
C  -1.715502 -0.644416 0.807701
C  -2.139785 0.883523 -0.747398
C  -2.92114 -0.89744 0.24651
C  -3.98226 -1.900153 0.529767
C  -5.058283 -1.330645 1.425578
C  -5.068166 -1.622861 2.786032
C  -6.029448 -0.470677 0.917796
C  -6.023998 -1.066324 3.625374
C  -6.983549 0.08991 1.755146
C  -6.982354 -0.203399 3.112796
H  4.852929 1.622685 -0.661089
H  2.956584 -0.751962 -1.182023
H  6.199022 -1.89613 0.031824
H  4.855954 -2.167785 -1.076944
H  4.65372 -2.478193 0.642813
H  6.034528 -0.035887 1.767977
H  4.414996 -0.475134 2.298467
H  4.743997 1.152513 1.705145
H  6.105981 -0.459607 -2.317266
H  4.811798 0.010258 -5.459628
H  5.973303 1.300373 -5.23868
H  6.33414 -0.315513 -4.625185
H  4.121931 2.702715 -4.039434
H  2.971849 1.395541 -4.203827
H  3.334026 2.046688 -2.60577
H  0.072408 2.215314 -0.049001
H  0.20165 1.391169 1.508689
H  -1.247634 -1.211752 1.59745
H  -2.195867 1.690057 -1.462479
H  -3.518252 -2.761694 1.011165
H  -4.418837 -2.256505 -0.407047
H  -4.320103 -2.292448 3.194665
H  -6.044624 -0.237074 -0.140334
H  -6.017695 -1.306965 4.681009
H  -7.731812 0.75683 1.345626
H  -7.7276 0.233515 3.765256
elementType: O C H
totalener: -1079.75400164 hartree
nucrepener: 2011.09224728 hartree
electener: -3090.84624892 hartree
oneelecener: -5461.12140313 hartree
twoeener: 2370.27515420 hartree
cpcmener: -0.02536778 hartree
kineticenergy: 1074.85635240 hartree
xcener: -106.457670317668 hartree
chargesum: 0.0000000
charge: -0.277857 -0.482280 -0.277851 0.147264 -0.027458 -0.079959 -0.288340 -0.276535 -0.285701 0.387561 -0.011879 -0.228068 -0.244349 0.088400 -0.078124 -0.318056 -0.030959 0.207879 -0.071062 0.052445 -0.196365 -0.200219 -0.146022 -0.153092 -0.177703 0.101287 0.090419 0.098279 0.092141 0.097915 0.093893 0.098357 0.092980 0.121855 0.093717 0.095101 0.089147 0.100169 0.097743 0.081828 0.108581 0.110170 0.161862 0.174710 0.103023 0.116888 0.139133 0.138534 0.156551 0.156346 0.157703
qa: -0.2779 -0.4823 -0.2779 0.1473 -0.0275 -0.0800 -0.2883 -0.2765 -0.2857 0.3876 -0.0119 -0.2281 -0.2443 0.0884 -0.0781 -0.3181 -0.0310 0.2079 -0.0711 0.0524 -0.1964 -0.2002 -0.1460 -0.1531 -0.1777 0.1013 0.0904 0.0983 0.0921 0.0979 0.0939 0.0984 0.0930 0.1219 0.0937 0.0951 0.0891 0.1002 0.0977 0.0818 0.1086 0.1102 0.1619 0.1747 0.1030 0.1169 0.1391 0.1385 0.1566 0.1563 0.1577
va: 2.1159 2.0217 2.2763 3.7059 3.8236 3.8243 3.9131 3.8871 3.8888 4.1330 3.7068 3.9306 3.9397 3.8422 3.7343 3.9927 3.9469 3.6168 3.8266 3.6040 3.9445 3.9566 3.8888 3.9021 3.9068 1.0276 1.0313 0.9997 1.0017 1.0031 1.0013 0.9993 1.0190 1.0032 0.9967 0.9960 1.0066 0.9992 0.9985 1.0140 1.0020 0.9935 1.0077 0.9947 1.0118 1.0082 1.0041 1.0134 0.9908 0.9911 0.9905
dispcorr: -0.021699792 hartree
energy: -1079.775701430657
dipole: 27.67272 -27.85759 -0.18487 -2.21534 1.29606 -0.91928 -9.45629 9.00176 -0.45453
magnitude: 1.04204 au
magnitude: 2.64866 debye
