program: Orca
programVersion: 5.0.2
elementType: O O O C C C C C C C C C C C C C C C C C C C C C C H H H H H H H H H H H H H H H H H H H H H H H H H H
charge: 0
multiplicity: 1
keywords: wb97x-d3
keywords: def2-TZVPP
keywords: def2/J RIJCOSX
keywords: DEFGRID2
keywords: scfconv7
keywords: smallprint printgap noloewdin
keywords: NOSOSCF
formula: C22H26O3
InChI: InChI=1/C22H26O3/c1-15(2)10-19-20(22(19,3)4)21(23)25-14-17-12-18(24-13-17)11-16-8-6-5-7-9-16/h5-10,12-13,19-20H,11,14H2,1-4H3
51 atoms
O  1.071157 -1.029938 0.159789
O  2.928747 -0.735876 1.361358
O  -2.543794 -3.473867 0.062413
C  4.092765 -0.018703 -1.481713
C  3.880731 1.22741 -0.67426
C  2.746525 0.231259 -0.823734
C  4.113898 0.063907 -2.989179
C  5.028108 -1.072913 -0.941079
C  3.748272 2.564361 -1.286657
C  2.296055 -0.545038 0.348455
C  4.368861 3.684647 -0.900953
C  4.120865 4.981207 -1.613242
C  5.339587 3.780922 0.236116
C  0.499896 -1.817521 1.218472
C  -0.855062 -2.231755 0.781263
C  -2.025635 -1.411812 0.675958
C  -1.236909 -3.469548 0.392975
C  -3.0203 -2.217946 0.235522
C  -4.454242 -1.987204 -0.092725
C  -4.94011 -0.669932 0.448433
C  -5.079345 0.438579 -0.379534
C  -5.235776 -0.536301 1.80358
C  -5.510541 1.656668 0.132268
C  -5.666145 0.677375 2.317792
C  -5.805131 1.779239 1.482365
H  4.356806 1.20128 0.300235
H  1.95101 0.50517 -1.508391
H  3.377216 0.759161 -3.389798
H  3.909417 -0.915295 -3.426936
H  5.097266 0.382814 -3.341351
H  6.031118 -0.910299 -1.34102
H  4.713228 -2.073037 -1.246919
H  5.107577 -1.063036 0.143749
H  3.067712 2.634631 -2.130516
H  3.755114 5.745028 -0.921391
H  5.044364 5.375681 -2.046027
H  3.390707 4.879969 -2.416304
H  4.952219 4.438732 1.01992
H  5.579098 2.824113 0.696872
H  6.2790 4.228078 -0.100737
H  0.449805 -1.221773 2.132596
H  1.125307 -2.690441 1.416891
H  -2.103442 -0.36117 0.908198
H  -0.7073 -4.406916 0.316053
H  -5.054566 -2.80427 0.318415
H  -4.595352 -2.02013 -1.17755
H  -4.851157 0.350552 -1.435452
H  -5.128658 -1.391567 2.461071
H  -5.616432 2.509592 -0.526193
H  -5.895632 0.764225 3.372375
H  -6.143576 2.726375 1.8829
elementType: O C H
totalener: -1079.75596401 hartree
nucrepener: 2013.66075866 hartree
electener: -3093.41672267 hartree
oneelecener: -5466.24080288 hartree
twoeener: 2372.82408021 hartree
cpcmener: -0.02561866 hartree
kineticenergy: 1074.84157578 hartree
xcener: -106.457118598295 hartree
chargesum: -0.0000000
charge: -0.273573 -0.478318 -0.279036 0.100399 0.045462 -0.089278 -0.267707 -0.275645 -0.277120 0.397037 -0.046020 -0.218917 -0.253711 0.087478 -0.108188 -0.283072 -0.026605 0.172771 -0.010772 -0.003607 -0.176538 -0.201332 -0.155542 -0.146331 -0.167116 0.088575 0.087596 0.087429 0.097618 0.096502 0.095819 0.097956 0.092035 0.116133 0.092160 0.093280 0.087922 0.097365 0.090657 0.093584 0.111262 0.109468 0.162198 0.174527 0.109395 0.102182 0.138900 0.141597 0.156931 0.156625 0.157568
qa: -0.2736 -0.4783 -0.2790 0.1004 0.0455 -0.0893 -0.2677 -0.2756 -0.2771 0.3970 -0.0460 -0.2189 -0.2537 0.0875 -0.1082 -0.2831 -0.0266 0.1728 -0.0108 -0.0036 -0.1765 -0.2013 -0.1555 -0.1463 -0.1671 0.0886 0.0876 0.0874 0.0976 0.0965 0.0958 0.0980 0.0920 0.1161 0.0922 0.0933 0.0879 0.0974 0.0907 0.0936 0.1113 0.1095 0.1622 0.1745 0.1094 0.1022 0.1389 0.1416 0.1569 0.1566 0.1576
va: 2.1206 2.0289 2.2765 3.7001 3.7557 3.8645 3.9105 3.9034 3.8786 4.1567 3.7584 3.9217 3.9423 3.8482 3.7887 3.9575 3.9472 3.6755 3.8120 3.6330 3.9238 3.9345 3.8984 3.8893 3.8969 1.0357 1.0352 1.0062 1.0018 1.0022 1.0004 0.9993 1.0193 1.0115 0.9960 0.9962 1.0089 0.9964 1.0095 0.9975 0.9929 1.0019 1.0033 0.9958 1.0070 1.0059 1.0047 1.0026 0.9909 0.9908 0.9904
dispcorr: -0.021024093 hartree
energy: -1079.776988104868
dipole: 25.76568 -26.22575 -0.46007 18.39346 -18.06957 0.32390 -9.53133 8.77566 -0.75567
magnitude: 0.94213 au
magnitude: 2.39471 debye
