program: Orca
programVersion: 5.0.2
elementType: O O O C C C C C C C C C C C C C C C C C C C C C C H H H H H H H H H H H H H H H H H H H H H H H H H H
charge: 0
multiplicity: 1
keywords: wb97x-d3
keywords: def2-TZVPP
keywords: def2/J RIJCOSX
keywords: DEFGRID2
keywords: scfconv7
keywords: smallprint printgap noloewdin
keywords: NOSOSCF
formula: C22H26O3
InChI: InChI=1/C22H26O3/c1-15(2)10-19-20(22(19,3)4)21(23)25-14-17-12-18(24-13-17)11-16-8-6-5-7-9-16/h5-10,12-13,19-20H,11,14H2,1-4H3
51 atoms
O  1.183906 0.39919 0.033662
O  2.748763 1.746524 0.879454
O  -3.204402 0.227309 -0.323128
C  4.695039 -0.525017 -0.111514
C  4.685356 0.603384 -1.082679
C  3.363912 -0.005924 -0.634253
C  5.071879 -1.906504 -0.590271
C  5.12376 -0.258681 1.310567
C  5.128826 0.470448 -2.49241
C  2.443677 0.808966 0.177885
C  4.823059 1.333375 -3.465076
C  5.340857 1.156069 -4.859587
C  3.956876 2.536361 -3.253797
C  0.17059 1.138584 0.731611
C  -1.13895 0.512232 0.429774
C  -1.615701 -0.773009 0.847836
C  -2.150021 1.06532 -0.278089
C  -2.873995 -0.891906 0.363777
C  -3.920632 -1.938234 0.498741
C  -5.066058 -1.460361 1.359387
C  -6.163529 -0.820348 0.791612
C  -5.01594 -1.607561 2.742952
C  -7.1907 -0.33614 1.590787
C  -6.042235 -1.127329 3.543881
C  -7.132411 -0.48687 2.969371
H  4.874323 1.574798 -0.63301
H  2.872262 -0.657696 -1.347514
H  4.670302 -2.665828 0.083435
H  6.157373 -2.025685 -0.60938
H  4.694873 -2.125185 -1.58937
H  4.62287 -0.934215 2.007118
H  4.929862 0.761723 1.633324
H  6.198189 -0.430097 1.40502
H  5.762967 -0.377203 -2.735645
H  5.991342 0.28616 -4.950684
H  4.519128 1.039187 -5.571288
H  5.905704 2.034128 -5.184362
H  4.529315 3.457101 -3.395201
H  3.148895 2.563401 -3.989301
H  3.504434 2.576439 -2.264352
H  0.177944 2.18254 0.410147
H  0.372395 1.115624 1.805012
H  -1.088374 -1.503635 1.441444
H  -2.253812 2.012658 -0.784762
H  -3.457084 -2.82122 0.940552
H  -4.289759 -2.232405 -0.487608
H  -6.21968 -0.7025 -0.284249
H  -4.16564 -2.102842 3.197813
H  -8.038385 0.159806 1.134976
H  -5.990518 -1.252899 4.618069
H  -7.932875 -0.109322 3.592801
elementType: O C H
totalener: -1079.75468103 hartree
nucrepener: 2006.70666079 hartree
electener: -3086.46134182 hartree
oneelecener: -5452.39013713 hartree
twoeener: 2365.92879531 hartree
cpcmener: -0.02569182 hartree
kineticenergy: 1074.86312113 hartree
xcener: -106.459508914773 hartree
chargesum: -0.0000000
charge: -0.278241 -0.482175 -0.277816 0.148042 -0.042376 -0.061490 -0.291609 -0.273081 -0.275572 0.384128 -0.010171 -0.228154 -0.249187 0.089148 -0.079426 -0.317606 -0.029701 0.189899 -0.063693 0.065759 -0.195813 -0.205790 -0.155232 -0.150143 -0.174875 0.099845 0.089248 0.097815 0.100408 0.090490 0.098342 0.092607 0.094453 0.122714 0.088477 0.095092 0.093621 0.101027 0.093990 0.080939 0.107404 0.110878 0.161071 0.173913 0.108557 0.114558 0.139309 0.139904 0.155796 0.156907 0.157810
qa: -0.2782 -0.4822 -0.2778 0.1480 -0.0424 -0.0615 -0.2916 -0.2731 -0.2756 0.3841 -0.0102 -0.2282 -0.2492 0.0891 -0.0794 -0.3176 -0.0297 0.1899 -0.0637 0.0658 -0.1958 -0.2058 -0.1552 -0.1501 -0.1749 0.0998 0.0892 0.0978 0.1004 0.0905 0.0983 0.0926 0.0945 0.1227 0.0885 0.0951 0.0936 0.1010 0.0940 0.0809 0.1074 0.1109 0.1611 0.1739 0.1086 0.1146 0.1393 0.1399 0.1558 0.1569 0.1578
va: 2.1170 2.0214 2.2790 3.7248 3.8284 3.8183 3.9160 3.8807 3.8831 4.1362 3.7062 3.9289 3.9456 3.8474 3.7348 4.0048 3.9483 3.6461 3.8300 3.5689 3.9579 3.9487 3.8986 3.8939 3.9036 1.0260 1.0328 1.0030 0.9986 1.0013 0.9996 1.0193 1.0010 1.0036 1.0071 0.9962 0.9958 0.9981 0.9989 1.0143 1.0024 0.9928 1.0080 0.9949 1.0102 1.0054 1.0081 1.0041 0.9912 0.9907 0.9904
dispcorr: -0.021460748 hartree
energy: -1079.776141780065
dipole: 27.73605 -27.90113 -0.16508 -0.68001 -0.14009 -0.82010 -11.18631 10.62930 -0.55701
magnitude: 1.00502 au
magnitude: 2.55456 debye
