program: Orca
programVersion: 5.0.2
elementType: O O O C C C C C C C C C C C C C C C C C C C C C C H H H H H H H H H H H H H H H H H H H H H H H H H H
charge: 0
multiplicity: 1
keywords: wb97x-d3
keywords: def2-TZVPP
keywords: def2/J RIJCOSX
keywords: DEFGRID2
keywords: scfconv7
keywords: smallprint printgap noloewdin
keywords: NOSOSCF
formula: C22H26O3
InChI: InChI=1/C22H26O3/c1-15(2)10-19-20(22(19,3)4)21(23)25-14-17-12-18(24-13-17)11-16-8-6-5-7-9-16/h5-10,12-13,19-20H,11,14H2,1-4H3
51 atoms
O  1.629073 -1.750489 -0.167318
O  3.530464 -2.702092 -0.841705
O  -2.409396 -2.391159 1.201114
C  3.677129 0.530137 0.551933
C  2.614473 0.910001 -0.44144
C  3.437461 -0.34043 -0.667635
C  4.98431 1.283908 0.583347
C  3.23462 0.061834 1.916768
C  2.756449 2.050909 -1.366033
C  2.889574 -1.712067 -0.571995
C  1.823007 2.964911 -1.652731
C  2.10879 4.068372 -2.62759
C  0.441628 2.99734 -1.0696
C  0.974679 -3.022684 -0.034655
C  -0.455002 -2.711187 0.204861
C  -1.353795 -2.085934 -0.718804
C  -1.156099 -2.868309 1.350353
C  -2.52173 -1.910156 -0.059864
C  -3.792204 -1.235781 -0.428689
C  -3.916139 0.111245 0.245698
C  -4.799615 0.307538 1.300676
C  -3.114557 1.174225 -0.166222
C  -4.886729 1.543507 1.93071
C  -3.199237 2.408424 0.4598
C  -4.086934 2.596924 1.51263
H  1.606511 0.727687 -0.088042
H  4.218986 -0.275632 -1.418036
H  5.760773 0.680491 1.058163
H  4.883528 2.20538 1.161011
H  5.344039 1.55284 -0.409124
H  3.196111 0.909736 2.603839
H  3.939415 -0.662448 2.331528
H  2.246158 -0.39455 1.915421
H  3.717064 2.144772 -1.864744
H  2.01276 5.048774 -2.152825
H  3.1111 3.997767 -3.050443
H  1.393783 4.056821 -3.455083
H  0.2399 3.975832 -0.625498
H  -0.308978 2.855962 -1.852525
H  0.266584 2.24736 -0.300315
H  1.407627 -3.586167 0.794653
H  1.107295 -3.604019 -0.949331
H  -1.145113 -1.795022 -1.736799
H  -0.904142 -3.290829 2.311008
H  -4.648971 -1.863899 -0.172286
H  -3.802387 -1.113937 -1.513288
H  -5.429236 -0.510013 1.631968
H  -2.417831 1.034102 -0.985278
H  -5.582138 1.681423 2.749057
H  -2.572717 3.226209 0.125496
H  -4.154542 3.560328 2.001699
elementType: O C H
totalener: -1079.75313064 hartree
nucrepener: 2132.20262383 hartree
electener: -3211.95575447 hartree
oneelecener: -5702.89906910 hartree
twoeener: 2490.94331463 hartree
cpcmener: -0.02779164 hartree
kineticenergy: 1074.85937635 hartree
xcener: -106.459470475312 hartree
chargesum: -0.0000000
charge: -0.265844 -0.472516 -0.277426 0.086551 0.088050 -0.115457 -0.275056 -0.265542 -0.289973 0.412171 -0.041681 -0.221493 -0.268845 0.070667 -0.088044 -0.335637 -0.024782 0.209546 -0.067527 0.040428 -0.186467 -0.201031 -0.152665 -0.159386 -0.172575 0.089111 0.091417 0.097436 0.095872 0.087369 0.095502 0.098827 0.085545 0.117519 0.093480 0.088236 0.091877 0.096389 0.099562 0.088548 0.115838 0.117505 0.160491 0.175124 0.108047 0.117260 0.138862 0.147323 0.156250 0.163934 0.157210
qa: -0.2658 -0.4725 -0.2774 0.0866 0.0881 -0.1155 -0.2751 -0.2655 -0.2900 0.4122 -0.0417 -0.2215 -0.2688 0.0707 -0.0880 -0.3356 -0.0248 0.2095 -0.0675 0.0404 -0.1865 -0.2010 -0.1527 -0.1594 -0.1726 0.0891 0.0914 0.0974 0.0959 0.0874 0.0955 0.0988 0.0855 0.1175 0.0935 0.0882 0.0919 0.0964 0.0996 0.0885 0.1158 0.1175 0.1605 0.1751 0.1080 0.1173 0.1389 0.1473 0.1563 0.1639 0.1572
va: 2.1082 2.0335 2.2764 3.7277 3.7048 3.8635 3.9109 3.9017 3.8694 4.1664 3.7852 3.9207 3.9449 3.8434 3.7546 3.9869 3.9484 3.6176 3.8308 3.6309 3.9469 3.9476 3.8977 3.8930 3.9197 1.0204 1.0323 1.0015 1.0016 1.0064 1.0008 1.0007 1.0169 1.0103 0.9962 1.0088 0.9963 0.9970 0.9928 1.0058 1.0009 0.9980 1.0087 0.9950 1.0107 1.0062 1.0046 0.9974 0.9907 0.9873 0.9915
dispcorr: -0.023899803 hartree
energy: -1079.777030439420
dipole: 12.29785 -13.24487 -0.94702 21.36625 -20.33438 1.03187 -2.07258 2.28992 0.21734
magnitude: 1.41733 au
magnitude: 3.60258 debye
