program: Orca
programVersion: 5.0.2
elementType: O O O C C C C C C C C C C C C C C C C C C C C C C H H H H H H H H H H H H H H H H H H H H H H H H H H
charge: 0
multiplicity: 1
keywords: wb97x-d3
keywords: def2-TZVPP
keywords: def2/J RIJCOSX
keywords: DEFGRID2
keywords: scfconv7
keywords: smallprint printgap noloewdin
keywords: NOSOSCF
formula: C22H26O3
InChI: InChI=1/C22H26O3/c1-15(2)10-19-20(22(19,3)4)21(23)25-14-17-12-18(24-13-17)11-16-8-6-5-7-9-16/h5-10,12-13,19-20H,11,14H2,1-4H3
51 atoms
O  1.612448 -1.887489 -0.359402
O  0.740158 -0.650919 -2.005259
O  -2.224746 -2.653112 1.489023
C  1.811703 1.624371 -0.061881
C  2.592508 1.559662 -1.330731
C  2.375249 0.289805 -0.53438
C  2.457716 2.193383 1.1776
C  0.326551 1.887482 -0.126727
C  3.955964 2.13254 -1.46827
C  1.490982 -0.76504 -1.063802
C  4.837317 1.773209 -2.405154
C  6.18668 2.417418 -2.499474
C  4.565674 0.709554 -3.424274
C  0.720119 -2.978337 -0.649189
C  -0.616073 -2.748578 -0.036502
C  -1.750036 -2.070583 -0.592347
C  -0.973962 -3.079215 1.227009
C  -2.693584 -2.037857 0.377085
C  -4.029699 -1.395663 0.466414
C  -3.968044 -0.141794 1.308181
C  -3.398195 1.018019 0.78766
C  -4.427213 -0.133075 2.620244
C  -3.292788 2.164054 1.561259
C  -4.323016 1.013918 3.39846
C  -3.755075 2.164661 2.8719
H  1.983596 1.609124 -2.229873
H  3.216631 -0.074402 0.045042
H  2.381488 3.282929 1.188564
H  3.512797 1.932941 1.262423
H  1.956266 1.821092 2.073091
H  -0.12714 1.552839 -1.057534
H  0.137887 2.959888 -0.04151
H  -0.193855 1.397342 0.698759
H  4.239353 2.911448 -0.766191
H  6.983287 1.676855 -2.387202
H  6.334556 2.880943 -3.478648
H  6.332063 3.185261 -1.739435
H  3.586236 0.245838 -3.316677
H  4.633135 1.11575 -4.437208
H  5.316657 -0.082902 -3.362309
H  1.202189 -3.848861 -0.207213
H  0.650565 -3.143311 -1.724899
H  -1.844841 -1.65741 -1.583571
H  -0.459041 -3.600837 2.019456
H  -4.763023 -2.09225 0.880495
H  -4.356774 -1.154655 -0.546294
H  -3.030574 1.023164 -0.232415
H  -4.872905 -1.027915 3.038876
H  -2.847085 3.057093 1.140969
H  -4.68545 1.005826 4.418714
H  -3.673029 3.057991 3.477865
elementType: O C H
totalener: -1079.75287184 hartree
nucrepener: 2139.73093316 hartree
electener: -3219.48380501 hartree
oneelecener: -5718.94127594 hartree
twoeener: 2499.45747094 hartree
cpcmener: -0.02392202 hartree
kineticenergy: 1074.86524300 hartree
xcener: -106.461066746450 hartree
chargesum: -0.0000000
charge: -0.281637 -0.476506 -0.275363 0.175450 -0.046372 -0.088709 -0.296159 -0.297467 -0.277549 0.396383 -0.015416 -0.229197 -0.243776 0.068990 -0.073806 -0.327246 -0.034841 0.212433 -0.060269 0.066086 -0.226742 -0.192159 -0.158716 -0.153525 -0.168368 0.100868 0.092661 0.100069 0.091777 0.098597 0.093350 0.099094 0.101922 0.122907 0.094133 0.094404 0.088757 0.078486 0.098651 0.095561 0.118845 0.118484 0.157130 0.173604 0.108556 0.114998 0.149874 0.138502 0.159911 0.156002 0.157341
qa: -0.2816 -0.4765 -0.2754 0.1755 -0.0464 -0.0887 -0.2962 -0.2975 -0.2775 0.3964 -0.0154 -0.2292 -0.2438 0.0690 -0.0738 -0.3272 -0.0348 0.2124 -0.0603 0.0661 -0.2267 -0.1922 -0.1587 -0.1535 -0.1684 0.1009 0.0927 0.1001 0.0918 0.0986 0.0933 0.0991 0.1019 0.1229 0.0941 0.0944 0.0888 0.0785 0.0987 0.0956 0.1188 0.1185 0.1571 0.1736 0.1086 0.1150 0.1499 0.1385 0.1599 0.1560 0.1573
va: 2.1239 2.0226 2.2785 3.7215 3.8432 3.8055 3.9071 3.8876 3.8798 4.1569 3.7119 3.9295 3.9401 3.8544 3.6442 3.9833 3.9690 3.6236 3.8236 3.5670 3.9236 3.9595 3.8874 3.8968 3.9042 1.0258 1.0320 0.9987 1.0014 1.0029 1.0165 1.0024 0.9938 1.0028 0.9962 0.9960 1.0066 1.0191 0.9992 0.9984 0.9968 1.0070 1.0198 0.9944 1.0104 1.0078 0.9977 1.0051 0.9890 0.9909 0.9903
dispcorr: -0.024827627 hartree
energy: -1079.777699467719
dipole: 20.21198 -19.72515 0.48683 16.67200 -16.74614 -0.07414 -6.33411 6.81475 0.48064
magnitude: 0.68813 au
magnitude: 1.74908 debye
