program: Orca
programVersion: 5.0.2
elementType: O O O C C C C C C C C C C C C C C C C C C C C C C H H H H H H H H H H H H H H H H H H H H H H H H H H
charge: 0
multiplicity: 1
keywords: wb97x-d3
keywords: def2-TZVPP
keywords: def2/J RIJCOSX
keywords: DEFGRID2
keywords: scfconv7
keywords: smallprint printgap noloewdin
keywords: NOSOSCF
formula: C22H26O3
InChI: InChI=1/C22H26O3/c1-15(2)10-19-20(22(19,3)4)21(23)25-14-17-12-18(24-13-17)11-16-8-6-5-7-9-16/h5-10,12-13,19-20H,11,14H2,1-4H3
51 atoms
O  1.584705 -1.277571 -0.04605
O  3.230688 -2.584834 0.692864
O  -2.375815 -0.268914 -0.475964
C  3.889644 0.843269 0.051193
C  3.391344 0.553563 -1.334962
C  3.803016 -0.591696 -0.445566
C  5.282701 1.396298 0.222383
C  2.912834 1.363916 1.076657
C  4.192109 0.85811 -2.547328
C  2.865789 -1.581725 0.123886
C  4.020628 1.934739 -3.319115
C  4.841865 2.149557 -4.553559
C  3.007602 3.001552 -3.036703
C  0.610288 -2.155788 0.511809
C  -0.729235 -1.582362 0.219229
C  -1.984281 -2.175455 0.570437
C  -1.032194 -0.426707 -0.415196
C  -2.947059 -1.33487 0.122847
C  -4.431038 -1.363119 0.210723
C  -4.957786 -0.396548 1.245337
C  -5.205379 -0.824602 2.546539
C  -5.174477 0.941526 0.927358
C  -5.661962 0.063572 3.510499
C  -5.628368 1.832785 1.890204
C  -5.873595 1.396534 3.185324
H  2.319893 0.683186 -1.451974
H  4.767274 -1.04022 -0.66227
H  5.654392 1.201359 1.230374
H  5.285092 2.478434 0.072708
H  5.995053 0.966252 -0.481438
H  3.178077 1.029554 2.082027
H  1.88393 1.064475 0.885068
H  2.93388 2.45588 1.080965
H  4.960739 0.141617 -2.823116
H  5.551009 1.339467 -4.724548
H  4.205319 2.230923 -5.438968
H  5.405726 3.08435 -4.493599
H  2.243855 3.031389 -3.818942
H  2.501181 2.875351 -2.080991
H  3.479672 3.987329 -3.032249
H  0.760063 -2.25556 1.590649
H  0.705857 -3.154206 0.075896
H  -2.141685 -3.107437 1.091077
H  -0.439897 0.351164 -0.869695
H  -4.73317 -2.379993 0.464282
H  -4.865409 -1.138236 -0.767176
H  -5.04334 -1.863981 2.808372
H  -4.99295 1.291217 -0.082278
H  -5.856107 -0.287737 4.516139
H  -5.793245 2.870093 1.627371
H  -6.231279 2.0900 3.935666
elementType: O C H
totalener: -1079.75189853 hartree
nucrepener: 2045.57655598 hartree
electener: -3125.32845451 hartree
oneelecener: -5529.61255596 hartree
twoeener: 2404.28410145 hartree
cpcmener: -0.02667630 hartree
kineticenergy: 1074.85104693 hartree
xcener: -106.459909567709 hartree
chargesum: -0.0000000
charge: -0.270488 -0.469497 -0.282720 0.134473 0.027674 -0.137406 -0.268868 -0.290676 -0.284729 0.405416 -0.026930 -0.228955 -0.256294 0.093029 -0.008437 -0.356287 -0.072802 0.211426 -0.073105 0.063497 -0.201682 -0.201860 -0.149044 -0.154532 -0.174914 0.107366 0.093308 0.099607 0.094708 0.091294 0.103892 0.083892 0.094602 0.119628 0.088737 0.093633 0.093812 0.101663 0.087398 0.095311 0.111682 0.115717 0.159905 0.164096 0.107213 0.117119 0.139583 0.139159 0.156784 0.156177 0.157422
qa: -0.2705 -0.4695 -0.2827 0.1345 0.0277 -0.1374 -0.2689 -0.2907 -0.2847 0.4054 -0.0269 -0.2290 -0.2563 0.0930 -0.0084 -0.3563 -0.0728 0.2114 -0.0731 0.0635 -0.2017 -0.2019 -0.1490 -0.1545 -0.1749 0.1074 0.0933 0.0996 0.0947 0.0913 0.1039 0.0839 0.0946 0.1196 0.0887 0.0936 0.0938 0.1017 0.0874 0.0953 0.1117 0.1157 0.1599 0.1641 0.1072 0.1171 0.1396 0.1392 0.1568 0.1562 0.1574
va: 2.1239 2.0381 2.2752 3.6746 3.7511 3.9357 3.9072 3.9110 3.8640 4.1728 3.7047 3.9297 3.9445 3.8494 3.6918 4.0261 3.9501 3.6340 3.8251 3.5757 3.9479 3.9635 3.8916 3.8996 3.9043 1.0057 1.0331 1.0026 1.0020 1.0028 1.0001 1.0143 1.0018 1.0085 1.0079 0.9950 0.9965 0.9974 1.0073 0.9985 0.9944 0.9939 1.0064 1.0018 1.0102 1.0063 1.0043 1.0104 0.9908 0.9912 0.9907
dispcorr: -0.022747423 hartree
energy: -1079.774645957202
dipole: 20.19565 -20.82123 -0.62558 16.85613 -15.89549 0.96065 -8.87498 8.50226 -0.37272
magnitude: 1.20545 au
magnitude: 3.06401 debye
