program: Orca
programVersion: 5.0.2
elementType: O O O C C C C C C C C C C C C C C C C C C C C C C H H H H H H H H H H H H H H H H H H H H H H H H H H
charge: 0
multiplicity: 1
keywords: wb97x-d3
keywords: def2-TZVPP
keywords: def2/J RIJCOSX
keywords: DEFGRID2
keywords: scfconv7
keywords: smallprint printgap noloewdin
keywords: NOSOSCF
formula: C22H26O3
InChI: InChI=1/C22H26O3/c1-15(2)10-19-20(22(19,3)4)21(23)25-14-17-12-18(24-13-17)11-16-8-6-5-7-9-16/h5-10,12-13,19-20H,11,14H2,1-4H3
51 atoms
O  1.612618 -1.919939 -0.486726
O  0.64552 -0.611664 -2.020012
O  -2.1469 -2.61224 1.52641
C  1.864061 1.5337 0.00659
C  2.521392 1.583467 -1.332173
C  2.389986 0.252413 -0.627162
C  2.623369 2.008658 1.221715
C  0.377715 1.777398 0.104026
C  3.860383 2.195333 -1.537849
C  1.457872 -0.770146 -1.138276
C  4.720049 1.84272 -2.496755
C  6.042643 2.528632 -2.653533
C  4.44616 0.750056 -3.483615
C  0.685025 -2.986825 -0.752467
C  -0.617872 -2.743319 -0.076052
C  -1.783674 -2.089277 -0.592339
C  -0.907653 -3.037198 1.213889
C  -2.677578 -2.034433 0.421994
C  -4.015486 -1.404219 0.557361
C  -3.935465 -0.133369 1.371659
C  -3.378972 1.016072 0.814794
C  -4.369194 -0.096644 2.691778
C  -3.261093 2.178638 1.561358
C  -4.25191 1.066874 3.443147
C  -3.696534 2.206601 2.880865
H  1.831109 1.701389 -2.164227
H  3.284528 -0.146573 -0.16116
H  2.227121 1.541139 2.12531
H  2.525535 3.089874 1.342128
H  3.686905 1.774509 1.172002
H  -0.160094 1.511384 -0.804138
H  0.191013 2.836809 0.292252
H  -0.058772 1.215743 0.93253
H  4.138836 3.004657 -0.868506
H  6.86664 1.815487 -2.563856
H  6.136398 2.983124 -3.643545
H  6.192948 3.311074 -1.909526
H  5.222314 -0.018681 -3.434558
H  3.484327 0.262256 -3.33289
H  4.465264 1.138812 -4.505445
H  1.170549 -3.873648 -0.348295
H  0.561922 -3.131679 -1.826408
H  -1.931577 -1.707076 -1.589523
H  -0.348783 -3.530614 1.994607
H  -4.722933 -2.100394 1.015002
H  -4.387784 -1.186893 -0.445156
H  -3.032807 1.000242 -0.212611
H  -4.80475 -0.982955 3.138276
H  -2.829017 3.064473 1.112807
H  -4.594435 1.080265 4.470179
H  -3.605023 3.113298 3.465238
elementType: O C H
totalener: -1079.75271335 hartree
nucrepener: 2143.99060302 hartree
electener: -3223.74331638 hartree
oneelecener: -5727.50121327 hartree
twoeener: 2503.75789689 hartree
cpcmener: -0.02408101 hartree
kineticenergy: 1074.86812326 hartree
xcener: -106.461387219172 hartree
chargesum: -0.0000000
charge: -0.280150 -0.473795 -0.274717 0.176511 -0.034609 -0.105017 -0.295133 -0.295903 -0.284194 0.396748 -0.017831 -0.228212 -0.240255 0.068049 -0.073492 -0.323230 -0.035822 0.209074 -0.060620 0.066754 -0.228038 -0.192205 -0.157076 -0.153486 -0.166584 0.102462 0.093297 0.098364 0.098985 0.093361 0.090396 0.098525 0.102072 0.122315 0.093956 0.094861 0.088870 0.095671 0.078536 0.099448 0.120033 0.118627 0.157041 0.173880 0.108528 0.115725 0.148199 0.138334 0.158746 0.155769 0.157230
qa: -0.2801 -0.4738 -0.2747 0.1765 -0.0346 -0.1050 -0.2951 -0.2959 -0.2842 0.3967 -0.0178 -0.2282 -0.2403 0.0680 -0.0735 -0.3232 -0.0358 0.2091 -0.0606 0.0668 -0.2280 -0.1922 -0.1571 -0.1535 -0.1666 0.1025 0.0933 0.0984 0.0990 0.0934 0.0904 0.0985 0.1021 0.1223 0.0940 0.0949 0.0889 0.0957 0.0785 0.0994 0.1200 0.1186 0.1570 0.1739 0.1085 0.1157 0.1482 0.1383 0.1587 0.1558 0.1572
va: 2.1229 2.0270 2.2771 3.7213 3.8371 3.8025 3.9043 3.8899 3.8825 4.1658 3.7128 3.9297 3.9369 3.8529 3.6361 3.9831 3.9682 3.6246 3.8220 3.5655 3.9225 3.9596 3.8837 3.8969 3.9021 1.0260 1.0316 1.0030 0.9992 1.0014 1.0157 1.0022 0.9936 1.0023 0.9966 0.9960 1.0065 0.9988 1.0190 0.9993 0.9965 1.0061 1.0194 0.9944 1.0101 1.0074 0.9995 1.0049 0.9899 0.9910 0.9902
dispcorr: -0.025087526 hartree
energy: -1079.777800877251
dipole: 20.14093 -19.61747 0.52346 16.34498 -16.47334 -0.12836 -6.10971 6.56175 0.45204
magnitude: 0.70345 au
magnitude: 1.78802 debye
