program: Orca
programVersion: 5.0.2
elementType: O O O C C C C C C C C C C C C C C C C C C C C C C H H H H H H H H H H H H H H H H H H H H H H H H H H
charge: 0
multiplicity: 1
keywords: wb97x-d3
keywords: def2-TZVPP
keywords: def2/J RIJCOSX
keywords: DEFGRID2
keywords: scfconv7
keywords: smallprint printgap noloewdin
keywords: NOSOSCF
formula: C22H26O3
InChI: InChI=1/C22H26O3/c1-15(2)10-19-20(22(19,3)4)21(23)25-14-17-12-18(24-13-17)11-16-8-6-5-7-9-16/h5-10,12-13,19-20H,11,14H2,1-4H3
51 atoms
O  1.717513 -2.271899 -1.039253
O  2.409619 -1.834107 1.042561
O  -2.598268 -2.49402 -0.445749
C  4.039697 0.474645 -0.323671
C  2.743654 0.998254 0.2085
C  2.752015 -0.23074 -0.700316
C  4.733979 1.193986 -1.456454
C  5.011953 -0.157214 0.642552
C  2.11302 2.248166 -0.252107
C  2.307873 -1.509671 -0.118498
C  1.260313 3.010953 0.442653
C  0.725917 4.284663 -0.141011
C  0.76423 2.712423 1.825004
C  0.940098 -3.399149 -0.597519
C  -0.432997 -2.943312 -0.253988
C  -0.840627 -2.115868 0.844638
C  -1.547671 -3.133838 -0.997349
C  -2.158479 -1.865813 0.670286
C  -3.115623 -0.990407 1.389865
C  -3.478279 0.240326 0.586925
C  -2.483514 1.030575 0.013217
C  -4.807584 0.608975 0.412385
C  -2.812233 2.160351 -0.720902
C  -5.140117 1.743077 -0.319125
C  -4.143692 2.520971 -0.890003
H  2.575817 0.749454 1.250463
H  2.42556 -0.067037 -1.721153
H  5.306023 2.044498 -1.079788
H  4.045798 1.566105 -2.214595
H  5.433134 0.52165 -1.957617
H  4.532197 -0.585937 1.518966
H  5.718556 0.597413 0.993745
H  5.59061 -0.944976 0.155399
H  2.37334 2.579324 -1.253085
H  1.003208 5.143928 0.476372
H  1.095264 4.465522 -1.150565
H  -0.366878 4.274972 -0.17682
H  -0.327139 2.765162 1.857589
H  1.054687 1.732941 2.200435
H  1.126434 3.460617 2.535875
H  1.430633 -3.906986 0.233139
H  0.917368 -4.08468 -1.443445
H  -0.230847 -1.739873 1.650311
H  -1.733582 -3.685793 -1.906087
H  -2.650276 -0.695193 2.333319
H  -4.024028 -1.539844 1.650537
H  -1.440934 0.757017 0.132384
H  -5.592999 0.002513 0.84857
H  -2.026222 2.758427 -1.16523
H  -6.180815 2.013268 -0.447288
H  -4.401011 3.401023 -1.465494
elementType: O C H
totalener: -1079.75253144 hartree
nucrepener: 2172.39565726 hartree
electener: -3252.14818870 hartree
oneelecener: -5783.83891099 hartree
twoeener: 2531.69072229 hartree
cpcmener: -0.02438463 hartree
kineticenergy: 1074.85281694 hartree
xcener: -106.460797428740 hartree
chargesum: -0.0000000
charge: -0.287471 -0.478490 -0.278221 0.109905 0.009570 -0.070325 -0.285938 -0.272971 -0.249527 0.395307 -0.060166 -0.221580 -0.263106 0.082704 -0.085969 -0.309177 -0.038442 0.200439 -0.040706 0.030861 -0.210907 -0.188077 -0.153839 -0.144793 -0.180092 0.097526 0.090194 0.100364 0.090158 0.097611 0.091278 0.094074 0.096631 0.113843 0.100553 0.090913 0.083334 0.089267 0.092810 0.108148 0.116495 0.116703 0.166469 0.173792 0.111118 0.102776 0.147729 0.138947 0.168024 0.156067 0.156189
qa: -0.2875 -0.4785 -0.2782 0.1099 0.0096 -0.0703 -0.2859 -0.2730 -0.2495 0.3953 -0.0602 -0.2216 -0.2631 0.0827 -0.0860 -0.3092 -0.0384 0.2004 -0.0407 0.0309 -0.2109 -0.1881 -0.1538 -0.1448 -0.1801 0.0975 0.0902 0.1004 0.0902 0.0976 0.0913 0.0941 0.0966 0.1138 0.1006 0.0909 0.0833 0.0893 0.0928 0.1081 0.1165 0.1167 0.1665 0.1738 0.1111 0.1028 0.1477 0.1389 0.1680 0.1561 0.1562
va: 2.1144 2.0210 2.2779 3.7273 3.7943 3.7948 3.9152 3.8938 3.8714 4.1750 3.7557 3.9179 3.9346 3.8385 3.7123 3.9706 3.9709 3.6507 3.8268 3.6564 3.9128 3.9366 3.8844 3.8920 3.9271 1.0262 1.0352 1.0002 1.0061 1.0014 1.0213 0.9999 0.9998 1.0126 0.9972 1.0080 0.9989 0.9975 1.0101 0.9987 1.0118 0.9976 1.0153 0.9952 1.0043 1.0117 0.9937 1.0032 0.9825 0.9906 0.9924
dispcorr: -0.025187865 hartree
energy: -1079.777719309465
dipole: 14.89765 -15.05636 -0.15870 20.23715 -19.69613 0.54101 1.88079 -2.38178 -0.50099
magnitude: 0.75424 au
magnitude: 1.91712 debye
