program: Orca
programVersion: 5.0.2
elementType: O O O C C C C C C C C C C C C C C C C C C C C C C H H H H H H H H H H H H H H H H H H H H H H H H H H
charge: 0
multiplicity: 1
keywords: wb97x-d3
keywords: def2-TZVPP
keywords: def2/J RIJCOSX
keywords: DEFGRID2
keywords: scfconv7
keywords: smallprint printgap noloewdin
keywords: NOSOSCF
formula: C22H26O3
InChI: InChI=1/C22H26O3/c1-15(2)10-19-20(22(19,3)4)21(23)25-14-17-12-18(24-13-17)11-16-8-6-5-7-9-16/h5-10,12-13,19-20H,11,14H2,1-4H3
51 atoms
O  0.857956 -0.862738 -1.588564
O  1.241169 1.310448 -1.240392
O  -2.609077 0.707503 0.778046
C  3.778505 0.166665 0.251993
C  4.150131 0.731111 -1.085161
C  3.0169 -0.274663 -0.986981
C  4.660592 -0.881405 0.88781
C  3.138377 1.083297 1.265057
C  5.388553 0.360868 -1.797016
C  1.637829 0.169013 -1.269763
C  6.213885 1.188826 -2.446749
C  7.437474 0.662854 -3.136408
C  6.029954 2.67142 -2.562131
C  -0.51177 -0.589889 -1.92312
C  -1.345928 -0.327708 -0.721624
C  -1.748141 -1.268779 0.281946
C  -1.896877 0.852741 -0.357059
C  -2.512362 -0.586223 1.166155
C  -3.25206 -0.98578 2.391737
C  -4.746082 -0.862063 2.21196
C  -5.475722 -1.904597 1.646762
C  -5.411929 0.306749 2.567955
C  -6.843573 -1.784516 1.446602
C  -6.780385 0.430925 2.36657
C  -7.500238 -0.614329 1.804805
H  3.809484 1.749534 -1.237063
H  3.239296 -1.283594 -1.317237
H  5.513397 -0.413327 1.384413
H  5.050805 -1.603938 0.172193
H  4.105506 -1.439793 1.644191
H  2.572928 1.89604 0.814649
H  3.912347 1.533393 1.8903
H  2.465757 0.530873 1.924841
H  5.642054 -0.695327 -1.793677
H  7.426598 0.912478 -4.201025
H  8.345098 1.113145 -2.72511
H  7.530127 -0.41967 -3.047238
H  5.92633 2.966019 -3.609999
H  5.165029 3.055169 -2.02512
H  6.910559 3.19668 -2.183245
H  -0.847051 -1.491614 -2.434496
H  -0.574567 0.237163 -2.632184
H  -1.503586 -2.318818 0.328276
H  -1.873181 1.838511 -0.795274
H  -2.927156 -0.377749 3.241011
H  -2.983212 -2.01774 2.621786
H  -4.969458 -2.820042 1.362121
H  -4.858494 1.125998 3.011929
H  -7.397923 -2.606445 1.011302
H  -7.284616 1.345991 2.650759
H  -8.567413 -0.519394 1.64979
elementType: O C H
totalener: -1079.75542918 hartree
nucrepener: 2027.41957439 hartree
electener: -3107.17500357 hartree
oneelecener: -5494.26249167 hartree
twoeener: 2387.08748810 hartree
cpcmener: -0.02602683 hartree
kineticenergy: 1074.85898599 hartree
xcener: -106.460749579238 hartree
chargesum: -0.0000000
charge: -0.285978 -0.474453 -0.278496 0.098786 0.042122 -0.104695 -0.270998 -0.272230 -0.274612 0.408978 -0.050651 -0.216901 -0.251450 0.086893 -0.077597 -0.338579 -0.017901 0.199341 -0.059659 0.062051 -0.202623 -0.193249 -0.153535 -0.157984 -0.171997 0.089591 0.088187 0.096607 0.088193 0.096606 0.091448 0.095858 0.096654 0.116168 0.092004 0.092674 0.087403 0.096015 0.090210 0.094367 0.120840 0.118182 0.159242 0.171052 0.113947 0.110120 0.140907 0.139070 0.156324 0.156525 0.157223
qa: -0.2860 -0.4745 -0.2785 0.0988 0.0421 -0.1047 -0.2710 -0.2722 -0.2746 0.4090 -0.0507 -0.2169 -0.2514 0.0869 -0.0776 -0.3386 -0.0179 0.1993 -0.0597 0.0621 -0.2026 -0.1932 -0.1535 -0.1580 -0.1720 0.0896 0.0882 0.0966 0.0882 0.0966 0.0914 0.0959 0.0967 0.1162 0.0920 0.0927 0.0874 0.0960 0.0902 0.0944 0.1208 0.1182 0.1592 0.1711 0.1139 0.1101 0.1409 0.1391 0.1563 0.1565 0.1572
va: 2.1212 2.0344 2.2820 3.7027 3.7673 3.8371 3.9105 3.9031 3.8765 4.1722 3.7689 3.9211 3.9413 3.8396 3.6068 4.0102 3.9579 3.6338 3.8216 3.5694 3.9463 3.9555 3.8970 3.9001 3.9010 1.0351 1.0355 1.0020 1.0064 1.0021 1.0199 1.0000 1.0001 1.0117 0.9964 0.9963 1.0090 0.9966 1.0105 0.9974 0.9904 1.0084 1.0086 1.0002 1.0043 1.0088 1.0035 1.0077 0.9911 0.9909 0.9905
dispcorr: -0.021615542 hartree
energy: -1079.777044720892
dipole: 32.08799 -31.62200 0.46599 2.96814 -3.95414 -0.98599 -3.11463 3.17696 0.06234
magnitude: 1.09235 au
magnitude: 2.77652 debye
