program: Orca
programVersion: 5.0.2
elementType: O O O C C C C C C C C C C C C C C C C C C C C C C H H H H H H H H H H H H H H H H H H H H H H H H H H
charge: 0
multiplicity: 1
keywords: wb97x-d3
keywords: def2-TZVPP
keywords: def2/J RIJCOSX
keywords: DEFGRID2
keywords: scfconv7
keywords: smallprint printgap noloewdin
keywords: NOSOSCF
formula: C22H26O3
InChI: InChI=1/C22H26O3/c1-15(2)10-19-20(22(19,3)4)21(23)25-14-17-12-18(24-13-17)11-16-8-6-5-7-9-16/h5-10,12-13,19-20H,11,14H2,1-4H3
51 atoms
O  1.614449 -1.868785 -0.841518
O  2.51462 -1.424417 1.156018
O  -1.744861 -0.541404 1.751212
C  4.849038 -0.174987 -0.554961
C  3.89933 0.891236 -0.134781
C  3.362137 -0.357665 -0.814012
C  5.68439 0.037374 -1.794846
C  5.552077 -0.992082 0.500793
C  3.788522 2.202935 -0.822768
C  2.490911 -1.25831 -0.041605
C  2.633171 2.831063 -1.056165
C  2.58503 4.1541 -1.755376
C  1.302192 2.254668 -0.67127
C  0.543768 -2.600636 -0.227892
C  -0.470334 -1.668699 0.330138
C  -1.251255 -0.712657 -0.397994
C  -0.81122 -1.507035 1.62856
C  -2.003911 -0.054851 0.514506
C  -3.039523 1.005231 0.397377
C  -4.437705 0.444145 0.507936
C  -5.189217 0.194913 -0.636302
C  -4.984184 0.131113 1.750216
C  -6.459749 -0.357962 -0.544865
C  -6.25216 -0.425139 1.844237
C  -6.9938 -0.673467 0.696614
H  3.703491 0.914617 0.935376
H  3.067275 -0.237386 -1.850268
H  6.598759 0.584796 -1.555741
H  5.155231 0.597424 -2.566222
H  5.979127 -0.920591 -2.227708
H  4.993332 -1.063609 1.431117
H  6.516261 -0.535535 0.734132
H  5.748008 -2.006376 0.147134
H  4.71455 2.678289 -1.135179
H  3.573188 4.495029 -2.064286
H  1.95246 4.102398 -2.645908
H  2.147586 4.922682 -1.112746
H  1.367141 1.533029 0.140822
H  0.611072 3.040015 -0.360175
H  0.836442 1.751895 -1.52265
H  0.917638 -3.286951 0.5335
H  0.125162 -3.197481 -1.037628
H  -1.251786 -0.545574 -1.464021
H  -0.480407 -1.985832 2.537141
H  -2.911247 1.494945 -0.568815
H  -2.877738 1.769557 1.162499
H  -4.777438 0.436304 -1.609443
H  -4.418491 0.327151 2.653533
H  -7.032164 -0.542098 -1.445271
H  -6.663416 -0.662433 2.817223
H  -7.983743 -1.105164 0.770248
elementType: O C H
totalener: -1079.75221581 hartree
nucrepener: 2108.82320475 hartree
electener: -3188.57542055 hartree
oneelecener: -5656.89521785 hartree
twoeener: 2468.31979730 hartree
cpcmener: -0.02482918 hartree
kineticenergy: 1074.87449304 hartree
xcener: -106.462737977833 hartree
chargesum: -0.0000000
charge: -0.285892 -0.472857 -0.280551 0.152420 -0.007000 -0.077885 -0.283943 -0.282459 -0.318936 0.355756 0.014719 -0.228307 -0.264538 0.092828 -0.048497 -0.398825 -0.026968 0.249938 -0.061938 0.058615 -0.199649 -0.203116 -0.149663 -0.157056 -0.173577 0.101663 0.090345 0.098254 0.091832 0.097327 0.092415 0.093123 0.098298 0.120766 0.088011 0.095474 0.095936 0.089776 0.103523 0.104313 0.114151 0.120790 0.158457 0.173432 0.103290 0.118109 0.139138 0.138808 0.156388 0.156250 0.157514
qa: -0.2859 -0.4729 -0.2806 0.1524 -0.0070 -0.0779 -0.2839 -0.2825 -0.3189 0.3558 0.0147 -0.2283 -0.2645 0.0928 -0.0485 -0.3988 -0.0270 0.2499 -0.0619 0.0586 -0.1996 -0.2031 -0.1497 -0.1571 -0.1736 0.1017 0.0903 0.0983 0.0918 0.0973 0.0924 0.0931 0.0983 0.1208 0.0880 0.0955 0.0959 0.0898 0.1035 0.1043 0.1142 0.1208 0.1585 0.1734 0.1033 0.1181 0.1391 0.1388 0.1564 0.1562 0.1575
va: 2.1063 2.0273 2.2760 3.7038 3.8030 3.7918 3.9078 3.8898 3.9069 4.1886 3.6950 3.9346 3.9496 3.8416 3.6032 3.9770 3.9698 3.5653 3.8033 3.5964 3.9439 3.9610 3.8923 3.9027 3.9039 1.0261 1.0334 1.0001 1.0020 1.0030 1.0199 1.0010 0.9991 1.0047 1.0066 0.9949 0.9959 1.0018 1.0010 0.9951 1.0099 0.9898 1.0116 0.9976 1.0117 1.0071 1.0045 1.0133 0.9910 0.9914 0.9905
dispcorr: -0.024486738 hartree
energy: -1079.776702543367
dipole: 18.76351 -19.01008 -0.24657 12.32478 -11.89362 0.43117 -9.29459 8.07822 -1.21636
magnitude: 1.31387 au
magnitude: 3.33958 debye
