program: Orca
programVersion: 5.0.2
elementType: O O O C C C C C C C C C C C C C C C C C C C C C C H H H H H H H H H H H H H H H H H H H H H H H H H H
charge: 0
multiplicity: 1
keywords: wb97x-d3
keywords: def2-TZVPP
keywords: def2/J RIJCOSX
keywords: DEFGRID2
keywords: scfconv7
keywords: smallprint printgap noloewdin
keywords: NOSOSCF
formula: C22H26O3
InChI: InChI=1/C22H26O3/c1-15(2)10-19-20(22(19,3)4)21(23)25-14-17-12-18(24-13-17)11-16-8-6-5-7-9-16/h5-10,12-13,19-20H,11,14H2,1-4H3
51 atoms
O  1.631845 -1.842568 -0.570414
O  2.463976 -0.938765 1.297585
O  -1.83589 -0.138914 1.631311
C  4.897122 -0.266409 -0.607819
C  4.039934 0.935889 -0.418831
C  3.39717 -0.376019 -0.835908
C  5.740391 -0.38167 -1.85476
C  5.534474 -0.908135 0.599706
C  4.031187 2.08519 -1.360141
C  2.483384 -1.060619 0.094551
C  2.961107 2.844024 -1.611603
C  3.026833 3.999928 -2.561623
C  1.621261 2.610254 -0.983353
C  0.5745 -2.469478 0.16953
C  -0.502823 -1.499717 0.498795
C  -1.41673 -0.873766 -0.411592
C  -0.807184 -1.004681 1.720068
C  -2.20233 -0.058617 0.330959
C  -3.357349 0.817784 0.000182
C  -4.665792 0.240533 0.487583
C  -5.507175 -0.439618 -0.387777
C  -5.036299 0.345831 1.826431
C  -6.69265 -1.005607 0.062403
C  -6.217145 -0.224618 2.280207
C  -7.048935 -0.904281 1.399874
H  3.855687 1.191434 0.622235
H  3.102906 -0.446552 -1.876957
H  6.693008 0.136701 -1.725304
H  5.250811 0.036942 -2.734405
H  5.963491 -1.428349 -2.070971
H  5.631537 -1.987705 0.467409
H  4.981538 -0.731116 1.519672
H  6.539173 -0.504819 0.742137
H  4.966965 2.3258 -1.857352
H  2.79671 4.940314 -2.053487
H  4.009158 4.099922 -3.023368
H  2.287533 3.893332 -3.359976
H  0.874709 2.363799 -1.743595
H  1.620068 1.808824 -0.246403
H  1.264891 3.516832 -0.487047
H  0.960197 -2.95259 1.068574
H  0.20477 -3.249686 -0.494896
H  -1.480971 -1.024577 -1.478309
H  -0.392593 -1.17263 2.701999
H  -3.385142 0.941059 -1.083076
H  -3.203238 1.812937 0.427366
H  -5.234686 -0.525449 -1.433448
H  -4.400878 0.881279 2.522005
H  -7.338158 -1.526216 -0.633765
H  -6.488511 -0.137763 3.324831
H  -7.970097 -1.349246 1.754023
elementType: O C H
totalener: -1079.75339024 hartree
nucrepener: 2083.92453943 hartree
electener: -3163.67792968 hartree
oneelecener: -5607.18135445 hartree
twoeener: 2443.50342477 hartree
cpcmener: -0.02466969 hartree
kineticenergy: 1074.86616634 hartree
xcener: -106.460994233997 hartree
chargesum: -0.0000000
charge: -0.285294 -0.476035 -0.279645 0.151941 -0.022833 -0.085336 -0.286574 -0.278742 -0.297903 0.375938 -0.006561 -0.229233 -0.240270 0.090847 -0.067845 -0.356741 -0.020702 0.222086 -0.063546 0.061547 -0.202419 -0.200445 -0.145486 -0.156360 -0.175547 0.102185 0.089737 0.098182 0.091383 0.097093 0.099092 0.091595 0.093567 0.122139 0.095845 0.089444 0.093692 0.097716 0.077963 0.100882 0.115951 0.120752 0.158261 0.171895 0.102619 0.118064 0.138946 0.138554 0.156230 0.156156 0.157214
qa: -0.2853 -0.4760 -0.2796 0.1519 -0.0228 -0.0853 -0.2866 -0.2787 -0.2979 0.3759 -0.0066 -0.2292 -0.2403 0.0908 -0.0678 -0.3567 -0.0207 0.2221 -0.0635 0.0615 -0.2024 -0.2004 -0.1455 -0.1564 -0.1755 0.1022 0.0897 0.0982 0.0914 0.0971 0.0991 0.0916 0.0936 0.1221 0.0958 0.0894 0.0937 0.0977 0.0780 0.1009 0.1160 0.1208 0.1583 0.1719 0.1026 0.1181 0.1389 0.1386 0.1562 0.1562 0.1572
va: 2.1105 2.0255 2.2774 3.7019 3.8227 3.7874 3.9107 3.8897 3.8932 4.1706 3.7082 3.9307 3.9435 3.8327 3.6127 3.9963 3.9578 3.6065 3.8224 3.5882 3.9472 3.9569 3.8865 3.9015 3.9060 1.0268 1.0334 0.9996 1.0016 1.0029 0.9989 1.0193 1.0014 1.0038 0.9964 1.0062 0.9965 0.9990 1.0117 1.0000 1.0100 0.9908 1.0095 1.0000 1.0117 1.0044 1.0043 1.0135 0.9909 0.9913 0.9906
dispcorr: -0.023262741 hartree
energy: -1079.776652984015
dipole: 20.15402 -20.34269 -0.18867 10.68709 -10.59730 0.08979 -10.98498 9.74880 -1.23618
magnitude: 1.25372 au
magnitude: 3.18670 debye
