program: Orca
programVersion: 5.0.2
elementType: O O O C C C C C C C C C C C C C C C C C C C C C C H H H H H H H H H H H H H H H H H H H H H H H H H H
charge: 0
multiplicity: 1
keywords: wb97x-d3
keywords: def2-TZVPP
keywords: def2/J RIJCOSX
keywords: DEFGRID2
keywords: scfconv7
keywords: smallprint printgap noloewdin
keywords: NOSOSCF
formula: C22H26O3
InChI: InChI=1/C22H26O3/c1-15(2)10-19-20(22(19,3)4)21(23)25-14-17-12-18(24-13-17)11-16-8-6-5-7-9-16/h5-10,12-13,19-20H,11,14H2,1-4H3
51 atoms
O  1.534841 -1.733852 0.534614
O  1.493033 -1.31393 -1.660058
O  -2.705506 -2.17201 -0.482094
C  2.048288 1.610195 -0.645902
C  3.305235 1.010895 -1.202261
C  2.515071 0.246623 -0.161759
C  2.149332 2.733155 0.357041
C  0.850242 1.738763 -1.554345
C  4.64731 1.526125 -0.85658
C  1.80357 -0.990334 -0.537275
C  5.562015 1.988185 -1.715313
C  6.891496 2.482033 -1.228535
C  5.372334 2.074414 -3.198936
C  0.779721 -2.941676 0.340281
C  -0.680022 -2.660751 0.276881
C  -1.582011 -2.546263 1.384067
C  -1.426573 -2.420976 -0.827593
C  -2.797275 -2.251659 0.866347
C  -4.118491 -1.962379 1.483484
C  -4.408381 -0.480154 1.516283
C  -4.054654 0.279324 2.62804
C  -4.993787 0.158144 0.426542
C  -4.283053 1.648087 2.653732
C  -5.220687 1.527874 0.448177
C  -4.867044 2.277048 1.56237
H  3.195607 0.62398 -2.210096
H  2.923569 0.241125 0.843308
H  2.963656 2.598007 1.068041
H  1.223886 2.817869 0.930162
H  2.309364 3.68616 -0.15214
H  0.837755 1.004043 -2.356325
H  0.851542 2.7264 -2.020284
H  -0.082689 1.642546 -0.994712
H  4.90241 1.526837 0.199527
H  6.994968 2.393846 -0.146888
H  7.711589 1.925846 -1.691018
H  7.042472 3.531431 -1.496545
H  5.491667 3.106936 -3.53793
H  6.13492 1.491249 -3.721897
H  4.398243 1.729632 -3.540311
H  1.013308 -3.554906 1.209144
H  1.127354 -3.472418 -0.546263
H  -1.346786 -2.673391 2.429624
H  -1.196621 -2.405372 -1.881303
H  -4.110772 -2.361962 2.498361
H  -4.908095 -2.488938 0.94096
H  -3.59844 -0.205335 3.483754
H  -5.279529 -0.418348 -0.445693
H  -4.007637 2.222928 3.52906
H  -5.678367 2.010291 -0.406321
H  -5.04832 3.344138 1.581469
elementType: O C H
totalener: -1079.75470136 hartree
nucrepener: 2079.53354557 hartree
electener: -3159.28824694 hartree
oneelecener: -5598.52617137 hartree
twoeener: 2439.23792443 hartree
cpcmener: -0.02483005 hartree
kineticenergy: 1074.85802105 hartree
xcener: -106.459691941272 hartree
chargesum: -0.0000000
charge: -0.284722 -0.475849 -0.277045 0.127734 0.031220 -0.120173 -0.264105 -0.285435 -0.278250 0.402282 -0.039753 -0.221543 -0.252034 0.089380 -0.081299 -0.333495 -0.017106 0.209219 -0.066257 0.064702 -0.202603 -0.203501 -0.148932 -0.151987 -0.176555 0.091115 0.087949 0.086907 0.097988 0.095807 0.092827 0.095506 0.098755 0.117902 0.087756 0.092673 0.093172 0.095117 0.095756 0.089308 0.117844 0.119663 0.160635 0.168059 0.108296 0.114518 0.138761 0.139595 0.156934 0.155660 0.157603
qa: -0.2847 -0.4758 -0.2770 0.1277 0.0312 -0.1202 -0.2641 -0.2854 -0.2782 0.4023 -0.0398 -0.2215 -0.2520 0.0894 -0.0813 -0.3335 -0.0171 0.2092 -0.0663 0.0647 -0.2026 -0.2035 -0.1489 -0.1520 -0.1766 0.0911 0.0879 0.0869 0.0980 0.0958 0.0928 0.0955 0.0988 0.1179 0.0878 0.0927 0.0932 0.0951 0.0958 0.0893 0.1178 0.1197 0.1606 0.1681 0.1083 0.1145 0.1388 0.1396 0.1569 0.1557 0.1576
va: 2.1265 2.0283 2.2815 3.6785 3.7649 3.8870 3.9051 3.9046 3.8712 4.1759 3.7448 3.9232 3.9439 3.8115 3.6308 4.0213 3.9463 3.6187 3.8247 3.5750 3.9488 3.9636 3.8928 3.8980 3.9052 1.0327 1.0380 1.0054 1.0024 1.0029 1.0191 1.0009 0.9995 1.0096 1.0088 0.9960 0.9963 0.9974 0.9971 1.0093 0.9950 1.0113 1.0068 1.0066 1.0099 1.0087 1.0046 1.0097 0.9906 0.9912 0.9905
dispcorr: -0.022217989 hartree
energy: -1079.776919352172
dipole: 22.45956 -22.28869 0.17087 19.78613 -19.47240 0.31373 -5.48226 6.45844 0.97618
magnitude: 1.03949 au
magnitude: 2.64218 debye
