program: Orca
programVersion: 5.0.2
elementType: O O O C C C C C C C C C C C C C C C C C C C C C C H H H H H H H H H H H H H H H H H H H H H H H H H H
charge: 0
multiplicity: 1
keywords: wb97x-d3
keywords: def2-TZVPP
keywords: def2/J RIJCOSX
keywords: DEFGRID2
keywords: scfconv7
keywords: smallprint printgap noloewdin
keywords: NOSOSCF
formula: C22H26O3
InChI: InChI=1/C22H26O3/c1-15(2)10-19-20(22(19,3)4)21(23)25-14-17-12-18(24-13-17)11-16-8-6-5-7-9-16/h5-10,12-13,19-20H,11,14H2,1-4H3
51 atoms
O  1.879846 -2.177431 -0.831621
O  2.138764 -1.633787 1.322108
O  -2.43984 -2.18677 -0.86015
C  4.055803 0.602404 0.184934
C  2.688842 1.147175 0.408089
C  2.859879 -0.131714 -0.397288
C  4.945157 1.267555 -0.838305
C  4.818948 0.021028 1.349005
C  2.158826 2.360904 -0.262742
C  2.284572 -1.37133 0.149823
C  0.912337 2.44544 -0.735957
C  0.397675 3.686203 -1.395687
C  -0.049674 1.292721 -0.65705
C  1.024976 -3.285008 -0.500325
C  -0.378349 -2.81753 -0.335764
C  -1.013576 -2.273412 0.829135
C  -1.299972 -2.733462 -1.324437
C  -2.261262 -1.906424 0.452978
C  -3.37936 -1.234865 1.167701
C  -3.463608 0.236254 0.83083
C  -4.018412 0.662221 -0.374249
C  -2.954314 1.190048 1.706917
C  -4.057547 2.011443 -0.696778
C  -2.995503 2.541106 1.38866
C  -3.545377 2.956065 0.18375
H  2.299083 0.969425 1.408784
H  2.746547 -0.027816 -1.470342
H  5.488086 2.103545 -0.39188
H  4.384476 1.65328 -1.690299
H  5.685188 0.562859 -1.222685
H  5.478407 -0.785365 1.0212
H  4.173417 -0.371221 2.131783
H  5.446726 0.792688 1.799768
H  2.819603 3.219567 -0.345972
H  0.045084 3.472982 -2.408628
H  -0.461156 4.089031 -0.851634
H  1.155297 4.467635 -1.458468
H  -1.081357 1.631393 -0.758317
H  0.126968 0.574486 -1.463384
H  0.032127 0.746469 0.282936
H  1.389497 -3.809746 0.382929
H  1.106787 -3.961137 -1.350033
H  -0.593352 -2.169122 1.816627
H  -1.284395 -3.02182 -2.364584
H  -3.219413 -1.360258 2.239172
H  -4.324641 -1.730062 0.928893
H  -4.429837 -0.063698 -1.065851
H  -2.519927 0.873613 2.648172
H  -4.492264 2.326264 -1.637204
H  -2.595702 3.26961 2.082754
H  -3.577439 4.008685 -0.067389
elementType: O C H
totalener: -1079.75071499 hartree
nucrepener: 2222.77676847 hartree
electener: -3302.52748346 hartree
oneelecener: -5885.05865222 hartree
twoeener: 2582.53116876 hartree
cpcmener: -0.02290355 hartree
kineticenergy: 1074.86014684 hartree
xcener: -106.461967714808 hartree
chargesum: -0.0000000
charge: -0.287116 -0.477269 -0.277383 0.153661 0.006992 -0.081349 -0.283272 -0.281324 -0.344664 0.364462 0.042052 -0.226446 -0.254244 0.070821 -0.069921 -0.334367 -0.035012 0.226370 -0.054787 0.059484 -0.201976 -0.227951 -0.121976 -0.112191 -0.210035 0.100741 0.093127 0.098234 0.091487 0.097129 0.097796 0.091460 0.092851 0.120341 0.101658 0.089558 0.090261 0.065795 0.109576 0.091927 0.116568 0.118998 0.156714 0.172278 0.102510 0.116921 0.137376 0.137264 0.155105 0.156113 0.155652
qa: -0.2871 -0.4773 -0.2774 0.1537 0.0070 -0.0813 -0.2833 -0.2813 -0.3447 0.3645 0.0421 -0.2264 -0.2542 0.0708 -0.0699 -0.3344 -0.0350 0.2264 -0.0548 0.0595 -0.2020 -0.2280 -0.1220 -0.1122 -0.2100 0.1007 0.0931 0.0982 0.0915 0.0971 0.0978 0.0915 0.0929 0.1203 0.1017 0.0896 0.0903 0.0658 0.1096 0.0919 0.1166 0.1190 0.1567 0.1723 0.1025 0.1169 0.1374 0.1373 0.1551 0.1561 0.1557
va: 2.1059 2.0221 2.2727 3.7182 3.7837 3.8023 3.9066 3.8887 3.9153 4.1730 3.6762 3.9206 3.9535 3.8540 3.6462 3.9580 3.9577 3.5910 3.8092 3.5753 3.9514 3.9213 3.8534 3.8090 3.8865 1.0262 1.0340 1.0001 1.0025 1.0030 0.9992 1.0202 1.0011 1.0056 0.9948 0.9961 1.0078 1.0206 1.0023 1.0038 1.0097 0.9962 1.0203 0.9949 1.0135 1.0060 1.0138 1.0057 0.9911 0.9901 0.9928
dispcorr: -0.028582383 hartree
energy: -1079.779297372452
dipole: 12.97595 -13.22430 -0.24835 16.16928 -15.90897 0.26031 -2.12209 1.35658 -0.76552
magnitude: 0.84585 au
magnitude: 2.14997 debye
